{"text_format":"1","workbook":"xlsx","n_sheets":7,"sheets":["Start","User interface","Advanced options","Model overview","Model parameters","Chart Pivots","Calculations_new"],"not_rendered":{"charts":5,"images":5,"macros":1,"external_links":0,"defined_names":15,"comments":2,"pivot_tables":10},"unopened":[],"bounds":{"document_bytes":16777216,"sheet_cells":100000,"rows_first":2000,"rows_last":500,"rows_between":2000,"halvings":0,"cell_chars":16384,"cell_head_chars":4096},"cells_cut":0,"cells_raw":0,"read":"whole","date_system":"1900"}

{"sheet":"Start","index":0,"n_rows":3,"n_cols":2,"rows_kept":3,"cut":false,"hidden":false,"merged":[]}
[null,"SPACE Tool 2.0"]
[]
[null,"STI Prevention Allocation Consequences Estimator"]

{"sheet":"User interface","index":1,"n_rows":21,"n_cols":7,"rows_kept":21,"cut":false,"hidden":false,"merged":[[4,4,8,6],[9,1,9,2]]}
[null,"Impact of a change in your jurisdiction's annual funding on infections and direct medical costs"]
[]
[null,"Program inputs","What if I do not have access to these data?",null,"Estimated \n3-year impact",{"$f":"IFERROR(IF(C$9>C$8,_xlfn.CONCAT(TEXT(E16,\"###,###\"),\" infections averted\"), _xlfn.CONCAT(TEXT(ABS(E16),\"###,###\"),\" additional infections\")),\"\")","v":" additional infections"},{"$f":"IFERROR(IF(C$9>C$8,_xlfn.CONCAT(TEXT(E21,\"$###,###\"),\" saved\"), _xlfn.CONCAT(TEXT(ABS(E21),\"$###,###\"),\" additional costs\")),\"\")","v":"$ additional costs"}]
[null,"Size of population served by your program (all ages)",0,null,"Interpretation:"]
[null,"Reported number of chlamydia cases",0,null,{"$f":"IFERROR(IF(AND(C$9>C$8,ISNUMBER(C8),ISNUMBER(C9)),_xlfn.CONCAT(\"The increase in your annual funding will avert \",TEXT(ABS(E16),\"###,##0\"),\" (range: \",TEXT(ABS(F16),\"###,##0\"),,\"-\",TEXT(ABS(G16),\"###,##0\"),\") infections and will save \",TEXT(ABS(E21),\"$###,##0\"),\" (range: \",TEXT(ABS(F21),\"$###,##0\"),\"-\",TEXT(ABS(G21),\"$###,##0\"),\") in direct medical costs over the next three years.\"), IF(AND(C$9<C$8,ISNUMBER(C8),ISNUMBER(C9)),_xlfn.CONCAT(\"The decrease in your annual funding will result in \",TEXT(ABS(E16),\"###,##0\"),\" (range: \",TEXT(ABS(F16),\"###,##0\"),,\"-\",TEXT(ABS(G16),\"###,##0\"),\") additional infections and \",TEXT(ABS(E21),\"$###,##0\"),\" (range: \",TEXT(ABS(F21),\"$###,##0\"),\"-\",TEXT(ABS(G21),\"$###,##0\"),\") additional direct medical costs over the next three years.\"),””)),\"\")","v":""}]
[null,"Reported number of gonorrhea cases",0]
{"$rows_left_out":16}
{"sheet":"Advanced options","index":2,"n_rows":90,"n_cols":17,"rows_kept":90,"cut":false,"hidden":false,"merged":[[7,1,9,4],[3,1,6,3],[3,4,6,4],[3,10,6,10],[3,11,6,11],[3,8,6,9]]}
[null,"Advanced options and tables/charts to copy into other applications (e.g., Word documents, PowerPoint presentations)"]
[null,"!!!! Do NOT edit charts in the spreadsheet or add/delete columns to the table. To place a chart in another application, use the \"copy\" feature (not the \"cut\" feature) and paste it into a PowerPoint or Word document for editing. "]
[]
[null,"The main output was calculated for three years. If you would like to change the time frame, enter the number of years here: ",null,null,10,null,null,null,{"$f":"IFERROR(_xlfn.CONCAT(\"Estimated \",$E$4,\"-year impact\"),\"\")","v":"Estimated 10-year impact"},null,{"$f":"IFERROR(IF('User interface'!C9>'User interface'!C8,_xlfn.CONCAT(TEXT(O$9,\"###,###\"),\" infections averted\"), _xlfn.CONCAT(TEXT(ABS(O$9),\"###,###\"),\" additional infections\")),\"\")","v":" additional infections"},{"$f":"IFERROR(IF('User interface'!C9>'User interface'!C8,_xlfn.CONCAT(TEXT(O$14,\"$###,###\"),\" saved\"), _xlfn.CONCAT(TEXT(ABS(O$14),\"$###,###\"),\" additional costs\")),\"\")","v":"$ additional costs"},null,"Detailed output","Base case","Lower bound","Upper bound"]
[null,null,null,null,null,null,null,null,null,null,null,null,null,{"$f":"IFERROR(IF('User interface'!C9>'User interface'!C8,\"Chlamydia infections averted\",\"Additional chlamydia infections\"),\"\")","v":"Additional chlamydia infections"},{"$f":"IFERROR(ABS(ROUND(($E$4-1)*Calculations_new!AK2,0)),\"\")","v":""},{"$f":"IF(ISBLANK(Calculations_new!AL2),\"\",ROUND(($E$4-1)*Calculations_new!AL2,0))","v":{"$error":"#DIV/0!"}},{"$f":"IF(ISBLANK(Calculations_new!AM2),\"\",ROUND(($E$4-1)*Calculations_new!AM2,0))","v":{"$error":"#DIV/0!"}}]
[null,null,null,null,null,null,null,null,null,null,null,null,null,{"$f":"IFERROR(IF('User interface'!C9>'User interface'!C8,\"Gonorrhea infections averted\",\"Additional gonorrhea infections\"),\"\")","v":"Additional gonorrhea infections"},{"$f":"IFERROR(ABS(ROUND(($E$4-1)*Calculations_new!AK3,0)),\"\")","v":""},{"$f":"IF(ISBLANK(Calculations_new!AL3),\"\",ROUND(($E$4-1)*Calculations_new!AL3,0))","v":{"$error":"#DIV/0!"}},{"$f":"IF(ISBLANK(Calculations_new!AM3),\"\",ROUND(($E$4-1)*Calculations_new!AM3,0))","v":{"$error":"#DIV/0!"}}]
{"$rows_left_out":85}
{"sheet":"Model overview","index":3,"n_rows":36,"n_cols":2,"rows_kept":36,"cut":false,"hidden":false,"merged":[]}
[null,"Model overview: technical documentation"]
[null,"Short three-sentence summary that you can use in your presentations and reports"]
[null,"SPACE Tool 2.0 estimates the impact of changes in funding for the prevention of sexually transmitted infections (STIs) to federally-funded jurisdictions, in terms of the number of infections and their associated costs. The number of infections averted by an increase in funding or the number of additional infections that occur due to a decrease in funding is estimated using a model that predicts the effect of funding changes on STI incidence at the state level. This model is based on an analysis of more than 35 years of federal funding and state-level chlamydia and gonorrhea rates [1]."]
[]
[null,"Overview of the calculations"]
[null,"SPACE Tool 2.0 calculates the impact of funding change in several steps:"]
{"$rows_left_out":31}
{"sheet":"Model parameters","index":4,"n_rows":19,"n_cols":8,"rows_kept":19,"cut":false,"hidden":false,"merged":[]}
[null,"Model parameters"]
[null,"Parameter","Base value ","Lower bound ","Upper bound ",null,"Citations","Notes on Parameters and Ranges"]
[null,"Chlamydia: Estimated number of incident infections, nationally 2018",3983000,3401000,4719000,null,"Kreisel KM, Spicknall IH, Gargano JW, et al. Sexually transmitted infections among US women and men: Prevalence and incidence estimates, 2018. Sex Transm Dis. 2021;48(4):208-214.","The lower and upper bounds correspond to the 2.5th and 97.5th percentile. These were made available directly from the authors; the study reports the interquartile range (25th and 75th percentiles)."]
[null,"Reported number of chlamydia cases, nationally 2018",1758668,"-","-",null,"Centers for Disease Control and Prevention. Sexually transmitted disease surveillance 2018. Published 2021. Accessed March 15, 2021. https://www.cdc.gov/std/stats18/","The values reflect the US total, excluding territories."]
[null,"Gonorrhea: Estimated number of incident infections, nationally 2018",1568000,1236000,2107000,null,"Kreisel KM, Spicknall IH, Gargano JW, et al. Sexually transmitted infections among US women and men: Prevalence and incidence estimates, 2018. Sex Transm Dis. 2021;48(4):208-214.","The lower and upper bounds correspond to the 2.5th and 97.5th percentile. These were made available directly from the authors; the study reports the interquartile range (25th and 75th percentiles)."]
[null,"Reported number of gonorrhea cases, nationally 2018 ",583405,"-","-",null,"Centers for Disease Control and Prevention. Sexually transmitted disease surveillance 2018. Published 2021. Accessed March 15, 2021. https://www.cdc.gov/std/stats18/","The values reflect the US total, excluding territories."]
{"$rows_left_out":14}
{"sheet":"Chart Pivots","index":5,"n_rows":12,"n_cols":19,"rows_kept":12,"cut":false,"hidden":true,"merged":[]}
["","Chlamydia infections","Chlamydia costs",null,"","Gonorrhea infections","Gonorrhea costs",null,"","Syphilis infections","Syphilis costs",null,"","STI-attributable HIV infections","STI-attributable HIV costs",null,"Row Labels","STI infections","STI costs"]
["Year 1",0,0,null,"Year 1",0,0,null,"Year 1",0,0,null,"Year 1",0,0,null,"Year 1",0,0]
["Year 2",0,0,null,"Year 2",0,0,null,"Year 2",0,0,null,"Year 2",0,0,null,"Year 2",0,0]
["Year 3",0,0,null,"Year 3",0,0,null,"Year 3",0,0,null,"Year 3",0,0,null,"Year 3",0,0]
["Grand Total",null,null,null,"Year 4",0,0,null,"Year 4",0,0,null,"Year 4",0,0,null,"Year 4",0,0]
[null,null,null,null,"Year 5",0,0,null,"Year 5",0,0,null,"Year 5",0,0,null,"Year 5",0,0]
{"$rows_left_out":7}
{"sheet":"Calculations_new","index":6,"n_rows":77,"n_cols":87,"rows_kept":77,"cut":false,"hidden":true,"merged":[]}
["Infection","Population","Number of cases","Rate","New funding","log new funding per capita","Previous funding ","log funding per capita","Incidence adjustment factor","Incidence adjustment factor lower bound","Incidence adjustment factor upper bound","Funding impact coefficient","Funding coefficient high impact scenario","Funding coefficient low impact scenario","STD Incidence rate","STD Incidence rate lower bound","STD Incidence rate upper bound","change in funding per capita","percent change in STD rates, base case","percent change in STD rates, high impact scenario","percent change in STD rates, low impact scenario",null,null,"New STD incidence rate","New STD incidence rate low impact scenario","New STD incidence rate high impact scenario","Average lifetime cost per infection","Average lifetime cost per infection lower bound","Average lifetime cost per infection upper bound"," STD Cases saved"," STD cases saved  low impact scenario"," STD cases saved high impact scenario","Probability of STD-attributable infection","Probability of STD-attributable infection lower bound","Probability of STD-attributable infection upper bound",null,"Cases averted","Cases averted low impact scenario","Cases averted high impact scenario","Costs saved","Costs saved low impact scenario","Costs saved high impact scenario",null,null,"STI cases averted (base)","STI cases averted (SE)","STI cases mu","STI cases sigma","STI cases low","STI cases high",null,"HIV probability (base)","HIV probability (SE)","HIV probability mu","HIV probability sigma","HIV probability low","HIV probability cases high",null,{"$f":"AS1","v":"STI cases averted (base)"},{"$f":"AT1","v":"STI cases averted (SE)"},{"$f":"AZ1","v":"HIV probability (base)"},{"$f":"BA1","v":"HIV probability (SE)"},"Product (base)","Product (SE)","Product mu","Product sigma","Product lower bound","Product upper bound",null,"cost per case (base)","cost per case (SE)","cost per case mu","cost per case sigma","cost per case low","cost per case high",null,null,"Number of cases (base)","Number of cases (SE)","Cost per case (base)","Cost per case (SE)","Product (base)","Product (SE)","Product mu","Product sigma","Product lower bound","Product upper bound"]
["Chlamydia",{"$f":"IF('User interface'!$C$4=\"\",1,'User interface'!$C$4)","v":0},{"$f":"'User interface'!C$5","v":0},{"$f":"C2/(B2/100000)","v":{"$error":"#DIV/0!"}},{"$f":"IF('User interface'!$C$9=\"\",1,'User interface'!$C$9)","v":1},{"$f":"LN(E2/B2)","v":{"$error":"#DIV/0!"}},{"$f":"IF('User interface'!$C$8=\"\",1,'User interface'!$C$8)","v":1},{"$f":"LN(G2/B2)","v":{"$error":"#DIV/0!"}},{"$f":"'Model parameters'!C$3/'Model parameters'!$C$4","v":2.2647822101726991},{"$f":"'Model parameters'!D$3/'Model parameters'!$C$4","v":1.9338499364291613},{"$f":"'Model parameters'!E$3/'Model parameters'!$C$4","v":2.6832807556628087},{"$f":"'Model parameters'!$C16","v":-0.17899999999999999},{"$f":"'Model parameters'!$D16","v":-0.34799999999999998},{"$f":"'Model parameters'!$E16","v":0},{"$f":"I2*D2","v":{"$error":"#DIV/0!"}},{"$f":"J2*D2","v":{"$error":"#DIV/0!"}},{"$f":"K2*D2","v":{"$error":"#DIV/0!"}},{"$f":"ROUND((E2-G2)/B2,10)","v":{"$error":"#DIV/0!"}},{"$f":"POWER(1+L2,$R2)-1","v":{"$error":"#DIV/0!"}},{"$f":"POWER(1+M2,$R2)-1","v":{"$error":"#DIV/0!"}},{"$error":"#DIV/0!"},null,null,{"$f":"O2*(1+S2)","v":{"$error":"#DIV/0!"}},{"$f":"P2*(1+U2)","v":{"$error":"#DIV/0!"}},{"$f":"Q2*(1+T2)","v":{"$error":"#DIV/0!"}},{"$f":"'Model parameters'!$C12","v":190},{"$f":"'Model parameters'!$D12","v":100},{"$f":"'Model parameters'!$E12","v":340},{"$f":"B2*(O2-X2)/100000","v":{"$error":"#DIV/0!"}},{"$f":"B2*(P2-Y2)/100000","v":{"$error":"#DIV/0!"}},{"$f":"B2*(Q2-Z2)/100000","v":{"$error":"#DIV/0!"}},null,null,null,null,{"$f":"AS2","v":{"$error":"#DIV/0!"}},{"$f":"AW2","v":{"$error":"#DIV/0!"}},{"$error":"#DIV/0!"},{"$f":"CD2","v":{"$error":"#DIV/0!"}},{"$f":"CH2","v":{"$error":"#DIV/0!"}},{"$f":"CI2","v":{"$error":"#DIV/0!"}},null,null,{"$f":"ABS(AD2)","v":{"$error":"#DIV/0!"}},{"$f":"(ABS(AF2)-ABS(AE2))/(2*1.96)","v":{"$error":"#DIV/0!"}},{"$f":" LN(AS2) - 0.5*LN(1 + ((AT2*AT2) / (AS2*AS2)))","v":{"$error":"#DIV/0!"}},{"$f":" POWER(LN(1 + ((AT2*AT2) / (AS2*AS2))),0.5)","v":{"$error":"#DIV/0!"}},{"$f":"IF(AS2=0,0,_xlfn.LOGNORM.INV(0.25,AU2,AV2))","v":{"$error":"#DIV/0!"}},{"$f":"IF(AS2=0,0,_xlfn.LOGNORM.INV(0.75,AU2,AV2))","v":{"$error":"#DIV/0!"}},null,null,null,null,null,null,null,null,null,null,null,null,null,null,null,null,null,null,null,{"$f":"AA2","v":190},{"$f":"(AC2-AB2)/(2*1.96)","v":61.224489795918366},{"$f":" LN(BR2) - 0.5*LN(1 + ((BS2*BS2) / (BR2*BR2)))","v":5.1976288991984569},{"$f":" POWER(LN(1 + ((BS2*BS2) / (BR2*BR2))),0.5)","v":0.31430931568131765},{"$f":"_xlfn.LOGNORM.INV(0.25,BT2,BU2)","v":146.29578360027725},{"$f":"_xlfn.LOGNORM.INV(0.75,BT2,BU2)","v":223.54825818044631},null,null,{"$f":"AS2","v":{"$error":"#DIV/0!"}},{"$error":"#DIV/0!"},{"$f":"BR2","v":190},{"$f":"BS2","v":61.224489795918366},{"$f":"BZ2*CB2","v":{"$error":"#DIV/0!"}},{"$f":"SQRT((POWER(BZ2,2)*POWER(CC2,2))+(POWER(CB2,2)*POWER(CA2,2))+(POWER(CA2,2)*POWER(CC2,2)))","v":{"$error":"#DIV/0!"}},{"$f":" LN(CD2) - 0.5*LN(1 + ((CE2*CE2) / (CD2*CD2)))","v":{"$error":"#DIV/0!"}},{"$f":" POWER(LN(1 + ((CE2*CE2) / (CD2*CD2))),0.5)","v":{"$error":"#DIV/0!"}},{"$f":"IF(BZ2=0,0,_xlfn.LOGNORM.INV(0.25,CF2,CG2))","v":{"$error":"#DIV/0!"}},{"$f":"IF(BZ2=0,0,_xlfn.LOGNORM.INV(0.75,CF2,CG2))","v":{"$error":"#DIV/0!"}}]
["Gonorrhea",{"$f":"IF('User interface'!$C$4=\"\",1,'User interface'!$C$4)","v":0},{"$f":"'User interface'!C$6","v":0},{"$error":"#DIV/0!"},{"$f":"IF('User interface'!$C$9=\"\",1,'User interface'!$C$9)","v":1},{"$error":"#DIV/0!"},{"$f":"IF('User interface'!$C$8=\"\",1,'User interface'!$C$8)","v":1},{"$error":"#DIV/0!"},{"$f":"'Model parameters'!C$5/'Model parameters'!$C$6","v":2.6876698005673587},{"$f":"'Model parameters'!D5/'Model parameters'!$C$6","v":2.1185968581002905},{"$f":"'Model parameters'!E5/'Model parameters'!$C$6","v":3.6115562945123885},{"$f":"'Model parameters'!$C17","v":-0.313},{"$f":"'Model parameters'!$D17","v":-0.48599999999999999},{"$f":"'Model parameters'!$E17","v":-8.1000000000000003E-2},{"$error":"#DIV/0!"},{"$error":"#DIV/0!"},{"$error":"#DIV/0!"},{"$f":"ROUND((E3-G3)/B3,10)","v":{"$error":"#DIV/0!"}},{"$f":"POWER(1+L3,$R3)-1","v":{"$error":"#DIV/0!"}},{"$error":"#DIV/0!"},{"$error":"#DIV/0!"},null,null,{"$error":"#DIV/0!"},{"$error":"#DIV/0!"},{"$error":"#DIV/0!"},{"$f":"'Model parameters'!$C13","v":190},{"$f":"'Model parameters'!$D13","v":80},{"$f":"'Model parameters'!$E13","v":380},{"$f":"B3*(O3-X3)/100000","v":{"$error":"#DIV/0!"}},{"$error":"#DIV/0!"},{"$error":"#DIV/0!"},null,null,null,null,{"$f":"AS3","v":{"$error":"#DIV/0!"}},{"$error":"#DIV/0!"},{"$error":"#DIV/0!"},{"$error":"#DIV/0!"},{"$error":"#DIV/0!"},{"$error":"#DIV/0!"},null,null,{"$error":"#DIV/0!"},{"$error":"#DIV/0!"},{"$error":"#DIV/0!"},{"$error":"#DIV/0!"},{"$f":"IF(AS3=0,0,_xlfn.LOGNORM.INV(0.25,AU3,AV3))","v":{"$error":"#DIV/0!"}},{"$f":"IF(AS3=0,0,_xlfn.LOGNORM.INV(0.75,AU3,AV3))","v":{"$error":"#DIV/0!"}},null,null,null,null,null,null,null,null,null,null,null,null,null,null,null,null,null,null,null,190,76.530612244897966,5.1718486419194969,0.38775102898893526,135.68208612247901,228.92232104529384,null,null,{"$error":"#DIV/0!"},{"$error":"#DIV/0!"},{"$f":"BR3","v":190},76.530612244897966,{"$error":"#DIV/0!"},{"$error":"#DIV/0!"},{"$error":"#DIV/0!"},{"$error":"#DIV/0!"},{"$f":"IF(BZ3=0,0,_xlfn.LOGNORM.INV(0.25,CF3,CG3))","v":{"$error":"#DIV/0!"}},{"$f":"IF(BZ3=0,0,_xlfn.LOGNORM.INV(0.75,CF3,CG3))","v":{"$error":"#DIV/0!"}}]
["Syphilis",{"$f":"IF('User interface'!$C$4=\"\",1,'User interface'!$C$4)","v":0},{"$f":"'User interface'!C$7","v":0},{"$error":"#DIV/0!"},{"$f":"IF('User interface'!$C$9=\"\",1,'User interface'!$C$9)","v":1},{"$error":"#DIV/0!"},{"$f":"IF('User interface'!$C$8=\"\",1,'User interface'!$C$8)","v":1},{"$error":"#DIV/0!"},{"$f":"'Model parameters'!C$7/'Model parameters'!$C$8","v":4.1639334911445109},{"$f":"'Model parameters'!D$7/'Model parameters'!$C$8","v":3.0801699797507345},{"$f":"'Model parameters'!E$7/'Model parameters'!$C$8","v":5.6184582038045807},{"$f":"'Model parameters'!$C18","v":-0.313},{"$f":"'Model parameters'!$D18","v":-0.48599999999999999},{"$f":"'Model parameters'!$E18","v":-8.1000000000000003E-2},{"$error":"#DIV/0!"},{"$error":"#DIV/0!"},{"$error":"#DIV/0!"},{"$error":"#DIV/0!"},{"$error":"#DIV/0!"},{"$error":"#DIV/0!"},{"$error":"#DIV/0!"},null,null,{"$error":"#DIV/0!"},{"$error":"#DIV/0!"},{"$error":"#DIV/0!"},{"$f":"'Model parameters'!$C14","v":1300},{"$f":"'Model parameters'!$D14","v":800},{"$f":"'Model parameters'!$E14","v":2070},{"$f":"B4*(O4-X4)/100000","v":{"$error":"#DIV/0!"}},{"$f":"B4*(P4-Y4)/100000","v":{"$error":"#DIV/0!"}},{"$error":"#DIV/0!"},null,null,null,null,{"$f":"AS4","v":{"$error":"#DIV/0!"}},{"$error":"#DIV/0!"},{"$error":"#DIV/0!"},{"$error":"#DIV/0!"},{"$error":"#DIV/0!"},{"$error":"#DIV/0!"},null,null,{"$error":"#DIV/0!"},{"$error":"#DIV/0!"},{"$error":"#DIV/0!"},{"$error":"#DIV/0!"},{"$error":"#DIV/0!"},{"$error":"#DIV/0!"},null,null,null,null,null,null,null,null,null,null,null,null,null,null,null,null,null,null,null,1300,323.9795918367347,7.1399916658771589,0.24547047713510892,1068.9416705895187,1488.551809967116,null,null,{"$error":"#DIV/0!"},{"$error":"#DIV/0!"},1300,323.9795918367347,{"$error":"#DIV/0!"},{"$error":"#DIV/0!"},{"$error":"#DIV/0!"},{"$error":"#DIV/0!"},{"$error":"#DIV/0!"},{"$error":"#DIV/0!"}]
["Chlamydia-attributable HIV",{"$f":"IF('User interface'!$C$4=\"\",1,'User interface'!$C$4)","v":0},{"$f":"'User interface'!C$5","v":0},{"$error":"#DIV/0!"},{"$f":"IF('User interface'!$C$9=\"\",1,'User interface'!$C$9)","v":1},{"$error":"#DIV/0!"},{"$f":"IF('User interface'!$C$8=\"\",1,'User interface'!$C$8)","v":1},{"$error":"#DIV/0!"},{"$f":"'Model parameters'!C$3/'Model parameters'!$C$4","v":2.2647822101726991},{"$f":"J2","v":1.9338499364291613},2.6832807556628087,{"$f":"'Model parameters'!$C16","v":-0.17899999999999999},{"$f":"'Model parameters'!$D16","v":-0.34799999999999998},{"$f":"'Model parameters'!$E16","v":0},{"$error":"#DIV/0!"},{"$error":"#DIV/0!"},{"$error":"#DIV/0!"},{"$error":"#DIV/0!"},{"$error":"#DIV/0!"},{"$error":"#DIV/0!"},{"$error":"#DIV/0!"},null,null,{"$error":"#DIV/0!"},{"$error":"#DIV/0!"},{"$error":"#DIV/0!"},{"$f":"'Model parameters'!$C$15","v":461000},{"$f":"'Model parameters'!$D$15","v":358000},{"$f":"'Model parameters'!$E$15","v":537000},{"$f":"B5*(O5-X5)/100000","v":{"$error":"#DIV/0!"}},{"$error":"#DIV/0!"},{"$error":"#DIV/0!"},{"$f":"'Model parameters'!$C9","v":2.2000000000000001E-4},{"$f":"'Model parameters'!$D9","v":2.1999999999999999E-5},{"$f":"'Model parameters'!$E9","v":4.1800000000000002E-4},null,{"$f":"BK5","v":{"$error":"#DIV/0!"}},{"$f":"BO5","v":{"$error":"#DIV/0!"}},{"$error":"#DIV/0!"},{"$error":"#DIV/0!"},{"$error":"#DIV/0!"},{"$error":"#DIV/0!"},null,null,{"$error":"#DIV/0!"},{"$error":"#DIV/0!"},{"$error":"#DIV/0!"},{"$error":"#DIV/0!"},{"$error":"#DIV/0!"},{"$error":"#DIV/0!"},null,{"$f":"AG5","v":2.2000000000000001E-4},{"$f":"(AI5-AH5)/(2*1.96)","v":1.0102040816326532E-4},{"$f":" LN(AZ5) - 0.5*LN(1 + ((BA5*BA5) / (AZ5*AZ5)))","v":-8.5175441615878622},{"$f":" POWER(LN(1 + ((BA5*BA5) / (AZ5*AZ5))),0.5)","v":0.43740404656552895},{"$f":"_xlfn.LOGNORM.INV(0.25,BB5,BC5)","v":1.4885041124511745E-4},{"$f":"_xlfn.LOGNORM.INV(0.75,BB5,BC5)","v":2.6853760029286279E-4},null,{"$f":"AS5","v":{"$error":"#DIV/0!"}},{"$error":"#DIV/0!"},{"$f":"AZ5","v":2.2000000000000001E-4},1.0102040816326532E-4,{"$f":"BG5*BI5","v":{"$error":"#DIV/0!"}},{"$f":"SQRT((POWER(BG5,2)*POWER(BJ5,2))+(POWER(BI5,2)*POWER(BH5,2))+(POWER(BH5,2)*POWER(BJ5,2)))","v":{"$error":"#DIV/0!"}},{"$f":" LN(BK5) - 0.5*LN(1 + ((BL5*BL5) / (BK5*BK5)))","v":{"$error":"#DIV/0!"}},{"$f":" POWER(LN(1 + ((BL5*BL5) / (BK5*BK5))),0.5)","v":{"$error":"#DIV/0!"}},{"$f":"IF(BG5=0,0,_xlfn.LOGNORM.INV(0.25,BM5,BN5))","v":{"$error":"#DIV/0!"}},{"$f":"IF(BG5=0,0,_xlfn.LOGNORM.INV(0.75,BM5,BN5))","v":{"$error":"#DIV/0!"}},null,461000,45663.265306122448,13.036271519354475,9.8810957128361201E-2,429176.93190350872,490371.47599782993,null,null,{"$f":"BK5","v":{"$error":"#DIV/0!"}},{"$error":"#DIV/0!"},461000,45663.265306122448,{"$error":"#DIV/0!"},{"$error":"#DIV/0!"},{"$error":"#DIV/0!"},{"$error":"#DIV/0!"},{"$error":"#DIV/0!"},{"$error":"#DIV/0!"}]
["Gonorrhea-attributable HIV",{"$f":"IF('User interface'!$C$4=\"\",1,'User interface'!$C$4)","v":0},{"$f":"'User interface'!C$6","v":0},{"$error":"#DIV/0!"},{"$f":"IF('User interface'!$C$9=\"\",1,'User interface'!$C$9)","v":1},{"$error":"#DIV/0!"},{"$f":"IF('User interface'!$C$8=\"\",1,'User interface'!$C$8)","v":1},{"$error":"#DIV/0!"},{"$f":"'Model parameters'!C$5/'Model parameters'!$C$6","v":2.6876698005673587},2.1185968581002905,3.6115562945123885,{"$f":"'Model parameters'!$C17","v":-0.313},{"$f":"'Model parameters'!$D17","v":-0.48599999999999999},{"$f":"'Model parameters'!$E17","v":-8.1000000000000003E-2},{"$error":"#DIV/0!"},{"$error":"#DIV/0!"},{"$error":"#DIV/0!"},{"$error":"#DIV/0!"},{"$error":"#DIV/0!"},{"$error":"#DIV/0!"},{"$error":"#DIV/0!"},null,null,{"$error":"#DIV/0!"},{"$error":"#DIV/0!"},{"$error":"#DIV/0!"},{"$f":"'Model parameters'!$C$15","v":461000},{"$f":"'Model parameters'!$D$15","v":358000},{"$f":"'Model parameters'!$E$15","v":537000},{"$error":"#DIV/0!"},{"$error":"#DIV/0!"},{"$error":"#DIV/0!"},{"$f":"'Model parameters'!$C10","v":2.2000000000000001E-4},{"$f":"'Model parameters'!$D10","v":2.1999999999999999E-5},{"$f":"'Model parameters'!$E10","v":4.1800000000000002E-4},null,{"$f":"BK6","v":{"$error":"#DIV/0!"}},{"$error":"#DIV/0!"},{"$error":"#DIV/0!"},{"$error":"#DIV/0!"},{"$error":"#DIV/0!"},{"$error":"#DIV/0!"},null,null,{"$error":"#DIV/0!"},{"$error":"#DIV/0!"},{"$error":"#DIV/0!"},{"$error":"#DIV/0!"},{"$error":"#DIV/0!"},{"$error":"#DIV/0!"},null,{"$f":"AG6","v":2.2000000000000001E-4},{"$f":"(AI6-AH6)/(2*1.96)","v":1.0102040816326532E-4},{"$f":" LN(AZ6) - 0.5*LN(1 + ((BA6*BA6) / (AZ6*AZ6)))","v":-8.5175441615878622},{"$f":" POWER(LN(1 + ((BA6*BA6) / (AZ6*AZ6))),0.5)","v":0.43740404656552895},{"$f":"_xlfn.LOGNORM.INV(0.25,BB6,BC6)","v":1.4885041124511745E-4},{"$f":"_xlfn.LOGNORM.INV(0.75,BB6,BC6)","v":2.6853760029286279E-4},null,{"$error":"#DIV/0!"},{"$error":"#DIV/0!"},2.2000000000000001E-4,1.0102040816326532E-4,{"$f":"BG6*BI6","v":{"$error":"#DIV/0!"}},{"$f":"SQRT((POWER(BG6,2)*POWER(BJ6,2))+(POWER(BI6,2)*POWER(BH6,2))+(POWER(BH6,2)*POWER(BJ6,2)))","v":{"$error":"#DIV/0!"}},{"$f":" LN(BK6) - 0.5*LN(1 + ((BL6*BL6) / (BK6*BK6)))","v":{"$error":"#DIV/0!"}},{"$f":" POWER(LN(1 + ((BL6*BL6) / (BK6*BK6))),0.5)","v":{"$error":"#DIV/0!"}},{"$f":"IF(BG6=0,0,_xlfn.LOGNORM.INV(0.25,BM6,BN6))","v":{"$error":"#DIV/0!"}},{"$f":"IF(BG6=0,0,_xlfn.LOGNORM.INV(0.75,BM6,BN6))","v":{"$error":"#DIV/0!"}},null,461000,45663.265306122448,13.036271519354475,9.8810957128361201E-2,429176.93190350872,490371.47599782993,null,null,{"$error":"#DIV/0!"},{"$error":"#DIV/0!"},461000,45663.265306122448,{"$error":"#DIV/0!"},{"$error":"#DIV/0!"},{"$error":"#DIV/0!"},{"$error":"#DIV/0!"},{"$error":"#DIV/0!"},{"$error":"#DIV/0!"}]
{"$rows_left_out":71}