{"text_format":"1","workbook":"xlsx","n_sheets":20,"sheets":["Welcome","Page2","Page3","Page4","Page5","Page6","Results","Page8","Advanced_options_menu","Advanced_options_1","Advanced_options_2","Advanced_options_3","schematic","lower_bound_results","upper_bound_results","ranges","bounds","calcs1","dropdown","text_inserts"],"not_rendered":{"charts":0,"images":37,"macros":1,"external_links":0,"defined_names":0,"comments":0,"pivot_tables":0},"unopened":[],"bounds":{"document_bytes":16777216,"sheet_cells":100000,"rows_first":2000,"rows_last":500,"rows_between":2000,"halvings":0,"cell_chars":16384,"cell_head_chars":4096},"cells_cut":0,"cells_raw":0,"read":"whole","date_system":"1900"}

{"sheet":"Welcome","index":0,"n_rows":0,"n_cols":0,"rows_kept":0,"cut":false,"hidden":false,"merged":[]}

{"sheet":"Page2","index":1,"n_rows":17,"n_cols":2,"rows_kept":17,"cut":false,"hidden":false,"merged":[]}
[]
[]
[]
[]
[]
[]
[]
[]
[]
[]
{"$rows_left_out":8}
{"sheet":"Page3","index":2,"n_rows":24,"n_cols":2,"rows_kept":24,"cut":false,"hidden":false,"merged":[]}
[]
[]
[]
[]
[]
[]
[]
[]
[]
[null,"Amount of budget decrease"]
{"$rows_left_out":15}
{"sheet":"Page4","index":3,"n_rows":0,"n_cols":0,"rows_kept":0,"cut":false,"hidden":false,"merged":[]}

{"sheet":"Page5","index":4,"n_rows":15,"n_cols":4,"rows_kept":15,"cut":false,"hidden":false,"merged":[]}
[]
[]
[]
[]
[]
[]
[]
[]
[null,"Input","Default value","Your value \nLeave blank to use the default value"]
[null,"Number of Disease Intervention Specialists (DIS) employed ",{"$f":"calcs1!B63","v":0}]
{"$rows_left_out":6}
{"sheet":"Page6","index":5,"n_rows":0,"n_cols":0,"rows_kept":0,"cut":false,"hidden":false,"merged":[]}

{"sheet":"Results","index":6,"n_rows":15,"n_cols":10,"rows_kept":15,"cut":false,"hidden":false,"merged":[]}
[]
[]
[]
[null,"Year",{"$f":"IF(calcs1!C41<0,\"Percentage increase in STDs due to budget cut\",\"Percentage decrease in STDs due to budget increase\")","v":"Percentage decrease in STDs due to budget increase"},{"$f":"IF(calcs1!C41<0,\"Additonal number of syphilis infections\",\"Reduction in number of syphilis infections\")","v":"Reduction in number of syphilis infections"},{"$f":"IF(calcs1!C41<0,\"Additonal number of gonorrhea infections\",\"Reduction in number of gonorrhea infections\")","v":"Reduction in number of gonorrhea infections"},{"$f":"IF(calcs1!C41<0,\"Additonal number of chlamydia infections\",\"Reduction in number of chlamydia infections\")","v":"Reduction in number of chlamydia infections"},{"$f":"IF(calcs1!C41<0,\"Additonal number of STD-attributable HIV infections\",\"Reduction in number of STD-attributable HIV infections\")","v":"Reduction in number of STD-attributable HIV infections"},{"$f":"IF(calcs1!C41<0,\"Additonal STD costs\",\"Reduction in STD costs\")","v":"Reduction in STD costs"},{"$f":"IF(calcs1!C41<0,\"Additonal HIV costs\",\"Reduction in HIV costs\")","v":"Reduction in HIV costs"},{"$f":"IF(calcs1!C41<0,\"Total additonal costs (STD and HIV)\",\"Reduction in total costs (STD + HIV)\")","v":"Reduction in total costs (STD + HIV)"}]
[null,"Year 1",{"$f":"calcs1!S71","v":0},{"$f":"calcs1!U71","v":0},{"$f":"calcs1!V71","v":0},{"$f":"calcs1!W71","v":0},{"$f":"calcs1!X71","v":0},{"$f":"calcs1!Y71","v":0},{"$f":"calcs1!Z71","v":0},{"$f":"calcs1!AA71","v":0}]
[null,"Year 2",{"$f":"calcs1!S72","v":0},{"$f":"calcs1!U72","v":0},{"$f":"calcs1!V72","v":0},{"$f":"calcs1!W72","v":0},{"$f":"calcs1!X72","v":0},{"$f":"calcs1!Y72","v":0},{"$f":"calcs1!Z72","v":0},{"$f":"calcs1!AA72","v":0}]
[null,"Year 3",{"$f":"calcs1!S73","v":0},{"$f":"calcs1!U73","v":0},{"$f":"calcs1!V73","v":0},{"$f":"calcs1!W73","v":0},{"$f":"calcs1!X73","v":0},{"$f":"calcs1!Y73","v":0},{"$f":"calcs1!Z73","v":0},{"$f":"calcs1!AA73","v":0}]
[null,"Year 4",{"$f":"calcs1!S74","v":0},{"$f":"calcs1!U74","v":0},{"$f":"calcs1!V74","v":0},{"$f":"calcs1!W74","v":0},{"$f":"calcs1!X74","v":0},{"$f":"calcs1!Y74","v":0},{"$f":"calcs1!Z74","v":0},{"$f":"calcs1!AA74","v":0}]
[null,"Year 5",{"$f":"calcs1!S75","v":0},{"$f":"calcs1!U75","v":0},{"$f":"calcs1!V75","v":0},{"$f":"calcs1!W75","v":0},{"$f":"calcs1!X75","v":0},{"$f":"calcs1!Y75","v":0},{"$f":"calcs1!Z75","v":0},{"$f":"calcs1!AA75","v":0}]
[null,"Year 6",{"$f":"calcs1!S76","v":0},{"$f":"calcs1!U76","v":0},{"$f":"calcs1!V76","v":0},{"$f":"calcs1!W76","v":0},{"$f":"calcs1!X76","v":0},{"$f":"calcs1!Y76","v":0},{"$f":"calcs1!Z76","v":0},{"$f":"calcs1!AA76","v":0}]
{"$rows_left_out":6}
{"sheet":"Page8","index":7,"n_rows":15,"n_cols":2,"rows_kept":15,"cut":false,"hidden":false,"merged":[]}
[]
[]
[]
[]
[]
[null,{"$f":"IF(calcs1!$B$31<0,text_inserts!F7,text_inserts!G7)","v":"Based on published evidence of the impact of STD prevention programs and the cost of STDs, a budget increase of $0 will result in:"}]
[null,{"$f":"IF(calcs1!$B$31<0,text_inserts!F8,text_inserts!G8)","v":"• In the first year alone, there will be an estimated decrease of 0 cases of syphilis (range: 0 to 0), 0 cases of gonorrhea (range: 0 to 0), 0 cases of chlamydia (range: 0 to 0), and 0.0 cases of STD-attributable HIV (range: 0.0 to 0.0)."}]
[null,{"$f":"IF(calcs1!$B$31<0,text_inserts!F9,text_inserts!G9)","v":"• Over 10 years, there will be an estimated cumulative decrease of 0 cases of syphilis (range: 0 to 0), 0 cases of gonorrhea (range: 0 to 0), 0 cases of chlamydia (range: 0 to 0), and 0.0 cases of STD-attributable HIV (range: 0 to 0)."}]
[null,{"$f":"IF(calcs1!$B$31<0,text_inserts!F10,text_inserts!G10)","v":"• Over 10 years, there will be an estimated cumulative decrease in direct medical costs of $0 (range: 0 to 0) due to decreases in STIs and STI-attributable HIV infections."}]
[]
{"$rows_left_out":6}
{"sheet":"Advanced_options_menu","index":8,"n_rows":0,"n_cols":0,"rows_kept":0,"cut":false,"hidden":false,"merged":[]}

{"sheet":"Advanced_options_1","index":9,"n_rows":7,"n_cols":3,"rows_kept":7,"cut":false,"hidden":false,"merged":[]}
[]
[]
[]
[]
[]
[]
[null,"Which calculation approach do you want to use?","Use the average of the two approaches (default)"]

{"sheet":"Advanced_options_2","index":10,"n_rows":25,"n_cols":4,"rows_kept":25,"cut":false,"hidden":false,"merged":[]}
[]
[]
[]
[]
[]
[]
[null,"Input","Default value","Your value (Leave blank to use the default value)"]
[null,"Percent change in  STDs relative to % change in number of STD cases interviewed",0.2]
[null,"Percent increase in STDs per $1 per capita decrease in STD prevention funding",0.16]
[null,"β parameter of residual impact, used to estimate new equilibrium STD incidence",0.7]
{"$rows_left_out":16}
{"sheet":"Advanced_options_3","index":11,"n_rows":0,"n_cols":0,"rows_kept":0,"cut":false,"hidden":false,"merged":[]}

{"sheet":"schematic","index":12,"n_rows":0,"n_cols":0,"rows_kept":0,"cut":false,"hidden":false,"merged":[]}

{"sheet":"lower_bound_results","index":13,"n_rows":15,"n_cols":10,"rows_kept":15,"cut":false,"hidden":false,"merged":[]}
[]
[]
[]
[null,"Year",{"$f":"IF(calcs1!C41<0,\"Percentage increase in STDs due to budget cut\",\"Percentage decrease in STDs due to budget increase\")","v":"Percentage decrease in STDs due to budget increase"},{"$f":"IF(calcs1!C41<0,\"Additonal number of syphilis infections\",\"Reduction in number of syphilis infections\")","v":"Reduction in number of syphilis infections"},{"$f":"IF(calcs1!C41<0,\"Additonal number of gonorrhea infections\",\"Reduction in number of gonorrhea infections\")","v":"Reduction in number of gonorrhea infections"},{"$f":"IF(calcs1!C41<0,\"Additonal number of chlamydia infections\",\"Reduction in number of chlamydia infections\")","v":"Reduction in number of chlamydia infections"},{"$f":"IF(calcs1!C41<0,\"Additonal number of STD-attributable HIV infections\",\"Reduction in number of STD-attributable HIV infections\")","v":"Reduction in number of STD-attributable HIV infections"},{"$f":"IF(calcs1!C41<0,\"Additonal STD costs\",\"Reduction in STD costs\")","v":"Reduction in STD costs"},{"$f":"IF(calcs1!C41<0,\"Additonal HIV costs\",\"Reduction in HIV costs\")","v":"Reduction in HIV costs"},{"$f":"IF(calcs1!C41<0,\"Total additonal costs (STD and HIV)\",\"Reduction in total costs (STD + HIV)\")","v":"Reduction in total costs (STD + HIV)"}]
[null,"Year 1",{"$f":"bounds!B224","v":0},{"$f":"bounds!D224","v":0},{"$f":"bounds!E224","v":0},{"$f":"bounds!F224","v":0},{"$f":"bounds!G224","v":0},{"$f":"bounds!K224","v":0},{"$f":"bounds!L224","v":0},{"$f":"bounds!M224","v":0}]
[null,"Year 2",{"$f":"bounds!B225","v":0},{"$f":"bounds!D225","v":0},{"$f":"bounds!E225","v":0},{"$f":"bounds!F225","v":0},{"$f":"bounds!G225","v":0},{"$f":"bounds!K225","v":0},{"$f":"bounds!L225","v":0},{"$f":"bounds!M225","v":0}]
[null,"Year 3",{"$f":"bounds!B226","v":0},{"$f":"bounds!D226","v":0},{"$f":"bounds!E226","v":0},{"$f":"bounds!F226","v":0},{"$f":"bounds!G226","v":0},{"$f":"bounds!K226","v":0},{"$f":"bounds!L226","v":0},{"$f":"bounds!M226","v":0}]
[null,"Year 4",{"$f":"bounds!B227","v":0},{"$f":"bounds!D227","v":0},{"$f":"bounds!E227","v":0},{"$f":"bounds!F227","v":0},{"$f":"bounds!G227","v":0},{"$f":"bounds!K227","v":0},{"$f":"bounds!L227","v":0},{"$f":"bounds!M227","v":0}]
[null,"Year 5",{"$f":"bounds!B228","v":0},{"$f":"bounds!D228","v":0},{"$f":"bounds!E228","v":0},{"$f":"bounds!F228","v":0},{"$f":"bounds!G228","v":0},{"$f":"bounds!K228","v":0},{"$f":"bounds!L228","v":0},{"$f":"bounds!M228","v":0}]
[null,"Year 6",{"$f":"bounds!B229","v":0},{"$f":"bounds!D229","v":0},{"$f":"bounds!E229","v":0},{"$f":"bounds!F229","v":0},{"$f":"bounds!G229","v":0},{"$f":"bounds!K229","v":0},{"$f":"bounds!L229","v":0},{"$f":"bounds!M229","v":0}]
{"$rows_left_out":6}
{"sheet":"upper_bound_results","index":14,"n_rows":15,"n_cols":10,"rows_kept":15,"cut":false,"hidden":false,"merged":[]}
[]
[]
[]
[null,"Year",{"$f":"IF(calcs1!C41<0,\"Percentage increase in STDs due to budget cut\",\"Percentage decrease in STDs due to budget increase\")","v":"Percentage decrease in STDs due to budget increase"},{"$f":"IF(calcs1!C41<0,\"Additonal number of syphilis infections\",\"Reduction in number of syphilis infections\")","v":"Reduction in number of syphilis infections"},{"$f":"IF(calcs1!C41<0,\"Additonal number of gonorrhea infections\",\"Reduction in number of gonorrhea infections\")","v":"Reduction in number of gonorrhea infections"},{"$f":"IF(calcs1!C41<0,\"Additonal number of chlamydia infections\",\"Reduction in number of chlamydia infections\")","v":"Reduction in number of chlamydia infections"},{"$f":"IF(calcs1!C41<0,\"Additonal number of STD-attributable HIV infections\",\"Reduction in number of STD-attributable HIV infections\")","v":"Reduction in number of STD-attributable HIV infections"},{"$f":"IF(calcs1!C41<0,\"Additonal STD costs\",\"Reduction in STD costs\")","v":"Reduction in STD costs"},{"$f":"IF(calcs1!C41<0,\"Additonal HIV costs\",\"Reduction in HIV costs\")","v":"Reduction in HIV costs"},{"$f":"IF(calcs1!C41<0,\"Total additonal costs (STD and HIV)\",\"Reduction in total costs (STD + HIV)\")","v":"Reduction in total costs (STD + HIV)"}]
[null,"Year 1",{"$f":"bounds!B241","v":0},{"$f":"bounds!D241","v":0},{"$f":"bounds!E241","v":0},{"$f":"bounds!F241","v":0},{"$f":"bounds!G241","v":0},{"$f":"bounds!K241","v":0},{"$f":"bounds!L241","v":0},{"$f":"bounds!M241","v":0}]
[null,"Year 2",{"$f":"bounds!B242","v":0},{"$f":"bounds!D242","v":0},{"$f":"bounds!E242","v":0},{"$f":"bounds!F242","v":0},{"$f":"bounds!G242","v":0},{"$f":"bounds!K242","v":0},{"$f":"bounds!L242","v":0},{"$f":"bounds!M242","v":0}]
[null,"Year 3",{"$f":"bounds!B243","v":0},{"$f":"bounds!D243","v":0},{"$f":"bounds!E243","v":0},{"$f":"bounds!F243","v":0},{"$f":"bounds!G243","v":0},{"$f":"bounds!K243","v":0},{"$f":"bounds!L243","v":0},{"$f":"bounds!M243","v":0}]
[null,"Year 4",{"$f":"bounds!B244","v":0},{"$f":"bounds!D244","v":0},{"$f":"bounds!E244","v":0},{"$f":"bounds!F244","v":0},{"$f":"bounds!G244","v":0},{"$f":"bounds!K244","v":0},{"$f":"bounds!L244","v":0},{"$f":"bounds!M244","v":0}]
[null,"Year 5",{"$f":"bounds!B245","v":0},{"$f":"bounds!D245","v":0},{"$f":"bounds!E245","v":0},{"$f":"bounds!F245","v":0},{"$f":"bounds!G245","v":0},{"$f":"bounds!K245","v":0},{"$f":"bounds!L245","v":0},{"$f":"bounds!M245","v":0}]
[null,"Year 6",{"$f":"bounds!B246","v":0},{"$f":"bounds!D246","v":0},{"$f":"bounds!E246","v":0},{"$f":"bounds!F246","v":0},{"$f":"bounds!G246","v":0},{"$f":"bounds!K246","v":0},{"$f":"bounds!L246","v":0},{"$f":"bounds!M246","v":0}]
{"$rows_left_out":6}
{"sheet":"ranges","index":15,"n_rows":78,"n_cols":7,"rows_kept":78,"cut":false,"hidden":true,"merged":[]}
[]
[]
[]
[null,"Percent change in STDs per $1 change in funding per capita (Β1 parameter)",0.16,0.09,0.23,{"$f":"C4*(D4/C4)","v":0.09},{"$f":"C4*(E4/C4)","v":0.23}]
[null,"Percent change in STDs per 10 percent change in Disease Intervention Specialist (DIS) activities ",0.02,5.0000000000000001E-3,0.05,{"$f":"C5*(D5/C5)","v":5.0000000000000001E-3},{"$f":"C5*(E5/C5)","v":0.05}]
[null,"Β0 parameter used to phase in the estimated changes in STD incidence (see text)",0.7,0.46,0.86,{"$f":"MIN(C6,D6)","v":0.46},{"$f":"MAX(C6,E6)","v":0.86}]
[null,"Average lifetime cost per syphilis infection ",770,385,1155,{"$f":"MIN(C7,D7)","v":385},{"$f":"MAX(C7,E7)","v":1155}]
[null,"Average lifetime cost per gonorrhea infection ",230,115,345,115,345]
[null,"Average lifetime cost per chlamydia infection ",210,105,315,105,315]
[null,"Average lifetime cost per HIV infection (both sexes)",351000,269000,427000,269000,427000]
{"$rows_left_out":69}
{"sheet":"bounds","index":16,"n_rows":251,"n_cols":27,"rows_kept":251,"cut":false,"hidden":true,"merged":[]}
[]
[]
[]
[null,"Percent change in STDs per $1 change in funding per capita (Β1 parameter)",0.16,0.09,0.23,{"$f":"C4*(D4/C4)","v":0.09},{"$f":"C4*(E4/C4)","v":0.23}]
[null,"Percent change in STDs per 10 percent change in Disease Intervention Specialist (DIS) activities ",0.02,5.0000000000000001E-3,0.05,{"$f":"C5*(D5/C5)","v":5.0000000000000001E-3},{"$f":"C5*(E5/C5)","v":0.05}]
[null,"Β0 parameter used to phase in the estimated changes in STD incidence (see text)",0.7,0.46,0.86,{"$f":"MIN(C6,D6)","v":0.46},{"$f":"MAX(C6,E6)","v":0.86}]
[null,"Average lifetime cost per syphilis infection ",770,385,1155,{"$f":"MIN(C7,D7)","v":385},{"$f":"MAX(C7,E7)","v":1155}]
[null,"Average lifetime cost per gonorrhea infection ",230,115,345,115,345,null,null,null,null,"DIS salary",{"$f":"calcs1!D45","v":73600}]
[null,"Average lifetime cost per chlamydia infection ",210,105,315,105,315,null,null,null,null,"Interviews per DIS",{"$f":"calcs1!D46","v":400},null,"reported cases",{"$f":"C47+C48+C49","v":0}]
[null,"Average lifetime cost per HIV infection (both sexes)",351000,269000,427000,269000,427000,null,null,null,null,"pct of Syphilis cases interviewed",{"$f":"calcs1!B49","v":0.89},null,"interviewed cases",{"$f":"M17","v":0}]
{"$rows_left_out":242}
{"sheet":"calcs1","index":17,"n_rows":81,"n_cols":31,"rows_kept":81,"cut":false,"hidden":true,"merged":[]}
[]
["Size of population served by STD program (all ages)",{"$f":"Page2!C13","v":0},null,null,null,null,null,null,null,null,null,null,null,null,null,null,null,null,null,null,"DIS",{"$f":"D44","v":0},null,{"$f":"V2","v":0},"starting number of DIS"]
["Reported number of syphilis cases",{"$f":"Page2!C17","v":0},null,null,null,null,null,null,null,null,null,null,null,null,null,null,null,null,null,null,null,null,null,{"$f":"V12","v":0},"change in DIS"]
["Reported number of gonorrhea cases",{"$f":"Page2!C16","v":0},null,null,null,null,null,null,null,null,null,null,null,null,null,null,null,null,null,null,"pct change in DIS",{"$f":"IF(V2=0,0,(V12/V2))","v":0},null,{"$f":"IF(X2+X3>0,X3,X2)","v":0},"change in DIS"]
["Reported number of chlamydia cases",{"$f":"Page2!C15","v":0},null,null,null,null,null,null,null,null,null,null,null,null,null,null,null,null,null,null,"applied pct change",{"$f":"IF(V4<-1,-1,IF(V4>1,1,V4))","v":0}]
["Annual cost of Disease Intervention Specialist (DIS)",73600]
["Annual number of STD cases interviewed per DIS",400,null,null,null,null,null,null,null,null,null,null,null,null,null,null,null,null,null,null,null,null,null,"change in interviews",null,null,"max decrease","max increase"]
["Percentage of syphilis cases interviewed",0.89,null,null,null,null,null,null,null,null,null,null,null,null,null,null,null,null,null,null,"Interviewed cases",{"$f":"V9+V10+V11","v":0},null,{"$f":"X4*D46","v":0},{"$f":"IF(V12<0,AA8,AB8)","v":0},null,{"$f":"MAX(-V8,X8)","v":0},{"$f":"MIN(X8,X13)","v":0}]
["Percentage of gonorrhea cases interviewed",0.17,null,null,null,null,null,null,null,null,null,null,null,null,null,null,null,null,null,null,{"$f":"A56","v":"interviewed CT cases"},{"$f":"B56","v":0},null,{"$f":"ROUND(ABS(Y8),0)","v":0}]
["Percentage of chlamydia cases interviewed",0.12,null,null,null,null,null,null,null,null,null,null,null,null,null,null,null,null,null,null,{"$f":"A57","v":"interviewed GC cases"},0]
{"$rows_left_out":72}
{"sheet":"dropdown","index":18,"n_rows":6,"n_cols":2,"rows_kept":6,"cut":false,"hidden":true,"merged":[]}
[]
[]
[]
[null,"Use the average of the two approaches (default)"]
[null,"Use the historical formula approach"]
[null,"Use the DIS approach"]

{"sheet":"text_inserts","index":19,"n_rows":48,"n_cols":7,"rows_kept":48,"cut":false,"hidden":true,"merged":[]}
[{"$f":"TEXT(D1,\"0\")","v":"0"},{"$f":"TEXT(D1,\"0,000\")","v":"0,000"},null,{"$f":"ABS(calcs1!B31)","v":0},{"$f":"IF(D1>1000,B1,A1)","v":"0"},{"$f":"\"With a budget cut of $\"&E1&\", positions for disease intervention specialists will be eliminated, resulting in:\"","v":"With a budget cut of $0, positions for disease intervention specialists will be eliminated, resulting in:"},{"$f":"\"With a budget increase of $\"&E1&\", positions for disease intervention specialists will be increased, resulting in:\"","v":"With a budget increase of $0, positions for disease intervention specialists will be increased, resulting in:"}]
[null,null,null,null,null,{"$f":"\"• No DIS interviews or effective behavioral counseling for an estimated \"&E8&\" patients with STDs.\"","v":"• No DIS interviews or effective behavioral counseling for an estimated 0 patients with STDs."},{"$f":"\"• Additional DIS interviews or effective behavioral counseling for an estimated \"&E8&\" patients with STDs.\"","v":"• Additional DIS interviews or effective behavioral counseling for an estimated 0 patients with STDs."}]
[null,null,null,null,null,"• DIS are public health professionals who work to find people diagnosed with syphilis and other STDs. DIS work to find new cases of the disease — and to prevent new ones from happening.","• DIS are public health professionals who work to find people diagnosed with syphilis and other STDs. DIS work to find new cases of the disease — and to prevent new ones from happening."]
[null,null,null,null,null,"• In addition to STDs, DIS fight other disease outbreaks and epidemics, including Ebola, flu, anthrax, and SARS—without these DIS, we could be underprepared for emergencies.","• In addition to STDs, DIS fight other disease outbreaks and epidemics, including Ebola, flu, anthrax, and SARS—with additional DIS, we will be better prepared for emergencies."]
[null,null,null,null,null,{"$f":"\"• Since an estimated 1 in \"&TEXT(D10,\"0\")&\" DIS interviews identifies a new STD case, an estimated \"&E9&\" people with syphilis, gonorrhea, or chlamydia will not know they are infected, will not be treated, and will be more likely to spread STDs in their communities.\"","v":"• Since an estimated 1 in 4 DIS interviews identifies a new STD case, an estimated 0 people with syphilis, gonorrhea, or chlamydia will not know they are infected, will not be treated, and will be more likely to spread STDs in their communities."},{"$f":"\"• Since an estimated 1 in \"&TEXT(D10,\"0\")&\" DIS interviews identifies a new STD case, an estimated \"&E9&\" people with syphilis, gonorrhea, or chlamydia will become aware that they are infected, will be more likely to be treated, and will be less likely to spread STDs in their communities.\"","v":"• Since an estimated 1 in 4 DIS interviews identifies a new STD case, an estimated 0 people with syphilis, gonorrhea, or chlamydia will become aware that they are infected, will be more likely to be treated, and will be less likely to spread STDs in their communities."}]
[null,null,"budget cut"]
[{"$f":"TEXT(D7,\"0.00\")","v":"0.00"},{"$f":"TEXT(D7,\"0,000\")","v":"0,000"},"DIS reduction",{"$f":"calcs1!W12","v":0},{"$f":"IF(D7>1000,B7,A7)","v":"0.00"},{"$f":"\"Based on published evidence of the impact of STD prevention programs and the cost of STDs, a budget cut of $\"&E1&\" will result in:\"","v":"Based on published evidence of the impact of STD prevention programs and the cost of STDs, a budget cut of $0 will result in:"},{"$f":"\"Based on published evidence of the impact of STD prevention programs and the cost of STDs, a budget increase of $\"&E1&\" will result in:\"","v":"Based on published evidence of the impact of STD prevention programs and the cost of STDs, a budget increase of $0 will result in:"}]
[{"$f":"TEXT(D8,\"0\")","v":"0"},{"$f":"TEXT(D8,\"0,000\")","v":"0,000"},"STD reduction",{"$f":"calcs1!X9","v":0},{"$f":"IF(D8>1000,B8,A8)","v":"0"},{"$f":"\"• In the first year alone, there will be an estimated increase of \"&E12&\" cases of syphilis \"&C39&\", \"&E13&\" cases of gonorrhea \"&C40&\", \"&E14&\" cases of chlamydia \"&C41&\", and \"&E15&\" cases of STD-attributable HIV \"&C42&\".\"","v":"• In the first year alone, there will be an estimated increase of 0 cases of syphilis (range: 0 to 0), 0 cases of gonorrhea (range: 0 to 0), 0 cases of chlamydia (range: 0 to 0), and 0.0 cases of STD-attributable HIV (range: 0.0 to 0.0)."},{"$f":"\"• In the first year alone, there will be an estimated decrease of \"&E12&\" cases of syphilis \"&C39&\", \"&E13&\" cases of gonorrhea \"&C40&\", \"&E14&\" cases of chlamydia \"&C41&\", and \"&E15&\" cases of STD-attributable HIV \"&C42&\".\"","v":"• In the first year alone, there will be an estimated decrease of 0 cases of syphilis (range: 0 to 0), 0 cases of gonorrhea (range: 0 to 0), 0 cases of chlamydia (range: 0 to 0), and 0.0 cases of STD-attributable HIV (range: 0.0 to 0.0)."}]
["0","0,000","unaware",{"$f":"ROUND(D8/D10,0)","v":0},"0",{"$f":"\"• Over 10 years, there will be an estimated cumulative increase of \"&E18&\" cases of syphilis \"&C44&\", \"&E19&\" cases of gonorrhea \"&C45&\", \"&E20&\" cases of chlamydia \"&C46&\", and \"&E21&\" cases of STD-attributable HIV \"&C47&\".\"","v":"• Over 10 years, there will be an estimated cumulative increase of 0 cases of syphilis (range: 0 to 0), 0 cases of gonorrhea (range: 0 to 0), 0 cases of chlamydia (range: 0 to 0), and 0.0 cases of STD-attributable HIV (range: 0 to 0)."},{"$f":"\"• Over 10 years, there will be an estimated cumulative decrease of \"&E18&\" cases of syphilis \"&C44&\", \"&E19&\" cases of gonorrhea \"&C45&\", \"&E20&\" cases of chlamydia \"&C46&\", and \"&E21&\" cases of STD-attributable HIV \"&C47&\".\"","v":"• Over 10 years, there will be an estimated cumulative decrease of 0 cases of syphilis (range: 0 to 0), 0 cases of gonorrhea (range: 0 to 0), 0 cases of chlamydia (range: 0 to 0), and 0.0 cases of STD-attributable HIV (range: 0 to 0)."}]
[null,null,"number needed to interview",{"$f":"calcs1!B11","v":4},null,{"$f":"\"• Over 10 years, there will be an estimated cumulative increase in direct medical costs of $\"&E23&\" \"&C48&\" due to increases in STIs and STI-attributable HIV infections.\"","v":"• Over 10 years, there will be an estimated cumulative increase in direct medical costs of $0 (range: 0 to 0) due to increases in STIs and STI-attributable HIV infections."},{"$f":"\"• Over 10 years, there will be an estimated cumulative decrease in direct medical costs of $\"&E23&\" \"&C48&\" due to decreases in STIs and STI-attributable HIV infections.\"","v":"• Over 10 years, there will be an estimated cumulative decrease in direct medical costs of $0 (range: 0 to 0) due to decreases in STIs and STI-attributable HIV infections."}]
{"$rows_left_out":38}