{"text_format":"1","workbook":"xlsx","n_sheets":13,"sheets":["Title","Introduction","1. Personnel","2. Activities","3. % of Families","4. Scenario Summary","5. Results – Vaccinated & Staff","6. Results – Time & Auxiliary","7. Results – Adding & Removing","Technical Appendix","Clinic Flow","Results INDEX-MATCH","Data_Modified"],"not_rendered":{"charts":0,"images":2,"macros":1,"external_links":0,"defined_names":0,"comments":0,"pivot_tables":0},"unopened":[],"bounds":{"document_bytes":16777216,"sheet_cells":100000,"rows_first":2000,"rows_last":500,"rows_between":2000,"halvings":0,"cell_chars":16384,"cell_head_chars":4096},"cells_cut":0,"cells_raw":0,"read":"whole","date_system":"1900"}

{"sheet":"Title","index":0,"n_rows":17,"n_cols":7,"rows_kept":17,"cut":false,"hidden":false,"merged":[[16,6,16,9],[6,0,7,15],[3,6,3,9],[24,0,24,15],[9,0,9,15],[10,0,10,15],[4,0,4,15]]}
[null,null,"CENTERS FOR DISEASE CONTROL & PREVENTION (CDC)"]
[]
[]
[null,null,null,null,null,null,"Maxi-Vac Alternative 2.0*"]
[" A tool for planning smallpox vaccination clinics and mass vaccination sites"]
[]
["Contributors to the Spreadsheet Adaptation:\nCastonguay, François M.; Fischer, Leah S.; Jeon, S; Washington, Michael L.; Meltzer, Martin I. "]
[]
[]
["Date of this version:"]
["2021-10-08"]
[]
[]
[]
[]
[]
[null,null,null,null,null,null,"Contact Info: HEMU@cdc.gov"]

{"sheet":"Introduction","index":1,"n_rows":28,"n_cols":14,"rows_kept":28,"cut":false,"hidden":false,"merged":[[12,13,12,16],[4,13,4,16],[6,13,6,16],[8,13,8,16],[10,13,10,16]]}
["Introduction"]
[]
[null,null,"About the Tool",null,null,null,null,null,null,null,null,"Navigation and Instructions"]
[]
[null,null,null,null,null,null,null,null,null,null,null,null,null,"Click the arrow buttons on the upper\nright corner to navigate through the tool. "]
[]
[null,null,null,null,null,null,null,null,null,null,null,"User Input",null,"Peach-colored cells are designated user\ninput cells in which users will select from\na drop down menu or enter a value.  There\nare four peach/user input cells in this tool."]
[null,null,"Background"]
[null,null,null,null,null,null,null,null,null,null,null,"Calculated, fixed, or linked cell",null,"Grey cells contain formula, calculated values,\nor fixed factors; they are automatically updated\nbased on user entries in the yellow cells."]
[]
[null,null,null,null,null,null,null,null,null,null,null,"Pop-up box",null,"Bright yellow buttons are for pop-up boxes\non tabs 1-4 that contain additional information\nor helpful hints regarding variable user inputs."]
[null,null,"Description of the Simulation Model"]
[null,null,null,null,null,null,null,null,null,null,null,"Pop-up box",null,"Red buttons are for pop-up boxes on tabs 5-7\n that contain interpretation for results."]
[]
[]
[]
[null,null,"How to Choose Between Maxi-Vac and Maxi-Vac Alternative"]
[]
[]
[]
[]
[]
[null,null,"Data Sources"]
[]
[]
[]
[]
[null,null,"Additional Reference"]

{"sheet":"1. Personnel","index":2,"n_rows":25,"n_cols":9,"rows_kept":25,"cut":false,"hidden":false,"merged":[[17,1,17,8],[24,1,25,7],[24,8,25,8],[22,1,23,7],[20,1,21,7],[18,1,19,7],[18,8,19,8],[20,8,21,8],[22,8,23,8]]}
["1. Select the number of staff available per 12-hour shift"]
[]
[]
[]
[]
[]
[]
[]
[null,"Number of shifts per 24-hour period (cannot be changed):",null,null,null,null,null,null,2]
[]
[null,"Select number of physicians per shift from pulldown menu:",null,null,null,null,null,null,1]
[]
[null,"Select number of nurses* per shift from pulldown menu:",null,null,null,null,null,null,15]
[]
[null,"Select number of other staff per shift from pulldown menu:",null,null,null,null,null,null,10]
[]
[]
[null,"Total Staff"]
[null,"Total number of physicians in a 24-hour period:",null,null,null,null,null,null,{"$f":"I11*I9","v":2}]
[]
[null,"Total number of nurses in a 24-hour period:",null,null,null,null,null,null,{"$f":"I13*I9","v":30}]
[]
[null,"Total number of other staff in a 24-hour period:",null,null,null,null,null,null,{"$f":"I15*I9","v":20}]
[]
[null,"Total staff in a 24-hour period:",null,null,null,null,null,null,{"$f":"I19+I21+I23","v":52}]

{"sheet":"2. Activities","index":3,"n_rows":23,"n_cols":13,"rows_kept":23,"cut":false,"hidden":false,"merged":[[16,1,17,3],[7,1,8,3],[7,4,8,4],[16,4,17,4]]}
["2. Indicate the station's activities supported"]
[]
[]
[null,null,null,null,null,null,null,null,null,"Dropdown menu options"]
[]
[null,null,null,null,null,null,null,"Activities that cannot be opt out of",null,"Yes",null,null,""]
[]
[null,"Select Yes/No for \"orientation\"\nfrom pulldown menu:",null,null,"Yes",null,null,"Size of orientation room",null,30]
[]
[null,null,null,null,null,null,null,"Number of physicians",null,1,3]
[]
[null,null,null,null,null,null,null,"Number of nurses",null,5,15,30]
[]
[null,null,null,null,null,null,null,"Number of other staff",null,5,10]
[]
[null,null,null,null,null,null,null,"Orientation",null,"Yes","No"]
[null,"Select Yes/No for \"witness\"\nfrom pulldown menu:",null,null,"Yes"]
[null,null,null,null,null,null,null,"Witness",null,"Yes","No"]
[]
[null,null,null,null,null,null,null,"Percentage of families",null,0.2,0.4]
[null,null,null,null,null,null,null,"sent to medical screeners"]
[]
[null,null,null,null,null,null,null,null,null,0.02,0.02,0.1]

{"sheet":"3. % of Families","index":4,"n_rows":12,"n_cols":11,"rows_kept":12,"cut":false,"hidden":false,"merged":[]}
["3. Enter percentages of families"]
[]
[]
[]
[]
[null,"Percentage of families turned away at triage:",null,null,null,null,null,null,null,null,0.02]
[]
[null,"Percentage of families that need to be treated elsewhere:",null,null,null,null,null,null,null,null,0.02]
[]
[null,"Select percentage of families sent to medical screeners from pulldown menu:",null,null,null,null,null,null,null,null,0.2]
[]
[null,"Percentage of families to see physician evaluator:",null,null,null,null,null,null,null,null,0.1]

{"sheet":"4. Scenario Summary","index":5,"n_rows":17,"n_cols":7,"rows_kept":17,"cut":false,"hidden":false,"merged":[[12,4,13,4],[5,4,6,4],[5,1,6,3],[2,1,2,3],[3,1,3,3],[4,1,4,3],[7,1,7,3],[12,1,13,3]]}
["4. Scenario Summary"]
[]
[null,"Number of physicians per shift:",null,null,{"$f":"IF('1. Personnel'!I11=0,\"*ERROR*\",'1. Personnel'!I11)","v":1}]
[null,"Number of nurses per shift:",null,null,{"$f":"IF('1. Personnel'!I13=0,\"*ERROR*\",'1. Personnel'!I13)","v":15}]
[null,"Number of other staff per shift:",null,null,{"$f":"IF('1. Personnel'!I15=0,\"*ERROR*\",'1. Personnel'!I15)","v":10}]
[null,"Total staff per shift",null,null,{"$f":"E3+E4+E5","v":26}]
[]
[null,"Total staff per 24 hours",null,null,{"$f":"'1. Personnel'!I9*'4. Scenario Summary'!E6","v":52}]
[null,null,null,null,null,null,"  "]
[null,null,null,"Orientation:",{"$f":"IF('2. Activities'!E8=0,\"*ERROR*\",'2. Activities'!E8)","v":"Yes"}]
[]
[]
[null,"Percentage of families\nsent to medical screeners: ",null,null,{"$f":"IF('3. % of Families'!K10=0,\"*ERROR*\",'3. % of Families'!K10)","v":0.2}]
[]
[]
[]
[null,null,null,"Witness:",{"$f":"IF('2. Activities'!E17=0,\"*ERROR*\",'2. Activities'!E17)","v":"Yes"}]

{"sheet":"5. Results – Vaccinated & Staff","index":6,"n_rows":18,"n_cols":10,"rows_kept":18,"cut":false,"hidden":false,"merged":[[51,1,51,4],[81,1,81,2],[66,1,66,2],[6,1,6,4],[6,6,6,9],[4,1,4,3],[2,1,2,3],[3,1,3,3],[36,1,36,4]]}
["5. Results for People Treated & Staff Placement and Utilization"]
[]
[null,"Total number of staff available per shift:",null,null,{"$f":"'1. Personnel'!I11+'1. Personnel'!I13+'1. Personnel'!I15","v":26}]
[null,"Actual number of staff used per shift:",null,null,{"$f":"'Results INDEX-MATCH'!F11","v":19}]
[null,"Maximum number of people that can\n be treated in a 24-hour period:",null,null,{"$f":"'Results INDEX-MATCH'!F12","v":3317}]
[]
[null,"Optimal Staff Placement by Station per Shift",null,null,null,null,"Staff Utilization (Percentage of Time Busy) per Shift"]
[null,"Station Description","Physicians","Nurses","Other Staff",null,"Station Description","Physicians","Nurses","Other Staff"]
[null,"Triage personnel",{"$f":"IF('Results INDEX-MATCH'!C17=\"na\",0,'Results INDEX-MATCH'!C17)","v":0},{"$f":"IF('Results INDEX-MATCH'!D17=\"na\",0,'Results INDEX-MATCH'!D17)","v":3},{"$f":"IF('Results INDEX-MATCH'!E17=\"na\",0,'Results INDEX-MATCH'!E17)","v":0},null,"Triage personnel",{"$f":"IF('Results INDEX-MATCH'!C32=\"na\",0,'Results INDEX-MATCH'!C32)","v":0},{"$f":"IF('Results INDEX-MATCH'!D32=\"na\",0,'Results INDEX-MATCH'!D32)","v":99.6},{"$f":"IF('Results INDEX-MATCH'!E32=\"na\",0,'Results INDEX-MATCH'!E32)","v":0}]
[null,"Orientation personnel",{"$f":"IF('Results INDEX-MATCH'!C18=\"na\",0,'Results INDEX-MATCH'!C18)","v":0},{"$f":"IF('Results INDEX-MATCH'!D18=\"na\",0,'Results INDEX-MATCH'!D18)","v":0},{"$f":"IF('Results INDEX-MATCH'!E18=\"na\",0,'Results INDEX-MATCH'!E18)","v":2},null,"Orientation personnel",{"$f":"IF('Results INDEX-MATCH'!C33=\"na\",0,'Results INDEX-MATCH'!C33)","v":0},{"$f":"IF('Results INDEX-MATCH'!D33=\"na\",0,'Results INDEX-MATCH'!D33)","v":0},{"$f":"IF('Results INDEX-MATCH'!E33=\"na\",0,'Results INDEX-MATCH'!E33)","v":53.5}]
[null,"Medical form helper",{"$f":"IF('Results INDEX-MATCH'!C19=\"na\",0,'Results INDEX-MATCH'!C19)","v":0},{"$f":"IF('Results INDEX-MATCH'!D19=\"na\",0,'Results INDEX-MATCH'!D19)","v":0},{"$f":"IF('Results INDEX-MATCH'!E19=\"na\",0,'Results INDEX-MATCH'!E19)","v":1},null,"Medical form helper",{"$f":"IF('Results INDEX-MATCH'!C34=\"na\",0,'Results INDEX-MATCH'!C34)","v":0},{"$f":"IF('Results INDEX-MATCH'!D34=\"na\",0,'Results INDEX-MATCH'!D34)","v":0},{"$f":"IF('Results INDEX-MATCH'!E34=\"na\",0,'Results INDEX-MATCH'!E34)","v":11.3}]
[null,"Referral personnel",{"$f":"IF('Results INDEX-MATCH'!C20=\"na\",0,'Results INDEX-MATCH'!C20)","v":0},{"$f":"IF('Results INDEX-MATCH'!D20=\"na\",0,'Results INDEX-MATCH'!D20)","v":0},{"$f":"IF('Results INDEX-MATCH'!E20=\"na\",0,'Results INDEX-MATCH'!E20)","v":1},null,"Referral personnel",{"$f":"IF('Results INDEX-MATCH'!C35=\"na\",0,'Results INDEX-MATCH'!C35)","v":0},{"$f":"IF('Results INDEX-MATCH'!D35=\"na\",0,'Results INDEX-MATCH'!D35)","v":0},{"$f":"IF('Results INDEX-MATCH'!E35=\"na\",0,'Results INDEX-MATCH'!E35)","v":65.3}]
[null,"Medical screener",{"$f":"IF('Results INDEX-MATCH'!C21=\"na\",0,'Results INDEX-MATCH'!C21)","v":0},{"$f":"IF('Results INDEX-MATCH'!D21=\"na\",0,'Results INDEX-MATCH'!D21)","v":2},{"$f":"IF('Results INDEX-MATCH'!E21=\"na\",0,'Results INDEX-MATCH'!E21)","v":0},null,"Medical screener",{"$f":"IF('Results INDEX-MATCH'!C36=\"na\",0,'Results INDEX-MATCH'!C36)","v":0},{"$f":"IF('Results INDEX-MATCH'!D36=\"na\",0,'Results INDEX-MATCH'!D36)","v":38.700000000000003},{"$f":"IF('Results INDEX-MATCH'!E36=\"na\",0,'Results INDEX-MATCH'!E36)","v":0}]
[null,"Physician evaluator",{"$f":"IF('Results INDEX-MATCH'!C22=\"na\",0,'Results INDEX-MATCH'!C22)","v":1},{"$f":"IF('Results INDEX-MATCH'!D22=\"na\",0,'Results INDEX-MATCH'!D22)","v":0},{"$f":"IF('Results INDEX-MATCH'!E22=\"na\",0,'Results INDEX-MATCH'!E22)","v":0},null,"Physician evaluator",{"$f":"IF('Results INDEX-MATCH'!C37=\"na\",0,'Results INDEX-MATCH'!C37)","v":45.1},{"$f":"IF('Results INDEX-MATCH'!D37=\"na\",0,'Results INDEX-MATCH'!D37)","v":0},{"$f":"IF('Results INDEX-MATCH'!E37=\"na\",0,'Results INDEX-MATCH'!E37)","v":0}]
[null,"Vaccinator",{"$f":"IF('Results INDEX-MATCH'!C23=\"na\",0,'Results INDEX-MATCH'!C23)","v":0},{"$f":"IF('Results INDEX-MATCH'!D23=\"na\",0,'Results INDEX-MATCH'!D23)","v":4},{"$f":"IF('Results INDEX-MATCH'!E23=\"na\",0,'Results INDEX-MATCH'!E23)","v":0},null,"Vaccinator",{"$f":"IF('Results INDEX-MATCH'!C38=\"na\",0,'Results INDEX-MATCH'!C38)","v":0},{"$f":"IF('Results INDEX-MATCH'!D38=\"na\",0,'Results INDEX-MATCH'!D38)","v":92.3},{"$f":"IF('Results INDEX-MATCH'!E38=\"na\",0,'Results INDEX-MATCH'!E38)","v":0}]
[null,"Witness",{"$f":"IF('Results INDEX-MATCH'!C24=\"na\",0,'Results INDEX-MATCH'!C24)","v":0},{"$f":"IF('Results INDEX-MATCH'!D24=\"na\",0,'Results INDEX-MATCH'!D24)","v":4},{"$f":"IF('Results INDEX-MATCH'!E24=\"na\",0,'Results INDEX-MATCH'!E24)","v":0},null,"Witness",{"$f":"IF('Results INDEX-MATCH'!C39=\"na\",0,'Results INDEX-MATCH'!C39)","v":0},{"$f":"IF('Results INDEX-MATCH'!D39=\"na\",0,'Results INDEX-MATCH'!D39)","v":92.3},{"$f":"IF('Results INDEX-MATCH'!E39=\"na\",0,'Results INDEX-MATCH'!E39)","v":0}]
[null,"Exit review Personnel",{"$f":"IF('Results INDEX-MATCH'!C25=\"na\",0,'Results INDEX-MATCH'!C25)","v":0},{"$f":"IF('Results INDEX-MATCH'!D25=\"na\",0,'Results INDEX-MATCH'!D25)","v":1},{"$f":"IF('Results INDEX-MATCH'!E25=\"na\",0,'Results INDEX-MATCH'!E25)","v":0},null,"Exit review Personnel",{"$f":"IF('Results INDEX-MATCH'!C40=\"na\",0,'Results INDEX-MATCH'!C40)","v":0},{"$f":"IF('Results INDEX-MATCH'!D40=\"na\",0,'Results INDEX-MATCH'!D40)","v":18.7},{"$f":"IF('Results INDEX-MATCH'!E40=\"na\",0,'Results INDEX-MATCH'!E40)","v":0}]
[null,"Total",{"$f":"SUM(C9:C17)","v":1},{"$f":"SUM(D9:D17)","v":14},{"$f":"SUM(E9:E17)","v":4}]

{"sheet":"6. Results – Time & Auxiliary","index":7,"n_rows":18,"n_cols":6,"rows_kept":18,"cut":false,"hidden":false,"merged":[[47,1,47,3],[2,4,2,5],[2,1,3,2]]}
["6. Results for Average Time Spent & Auxiliary Staff"]
[]
[null,"Average Time Families Spent\nat Each Station (in Minutes)",null,null,"Auxiliary Staff"]
[null,null,null,null,"Station Description","Number per shift"]
[null,"Station Description","Average time (in minutes)",null,"Form distribution",9]
[null,"Triage",{"$f":"'Results INDEX-MATCH'!C77","v":4.32},null,"Vaccine preparation",2]
[null,"Orientation",{"$f":"IF('Results INDEX-MATCH'!C78=\"na\",0,'Results INDEX-MATCH'!C78)","v":19.821000000000002},null,"Medical records data",10]
[null,"Medical froms help",{"$f":"'Results INDEX-MATCH'!C79","v":12.292999999999999},null,"Clinic manager",2]
[null,"Referral",{"$f":"'Results INDEX-MATCH'!C80","v":2.984},null,"Supply manager",2]
[null,"Medical screening",{"$f":"'Results INDEX-MATCH'!C81","v":4.1609999999999996},null,"Clinic QA reviewer",4]
[null,"Physician evaluation",{"$f":"'Results INDEX-MATCH'!C82","v":48.235999999999997},null,"Security",20]
[null,"Vaccination",{"$f":"'Results INDEX-MATCH'!C83","v":10.879},null,"Traffic flow",2]
[null,"Witness",{"$f":"IF('Results INDEX-MATCH'!C84=\"na\",0,'Results INDEX-MATCH'!C84)","v":10.879},null,"Translator","1 (per major language)"]
[null,"Review/Exit",{"$f":"'Results INDEX-MATCH'!C85","v":0.33},null,"Float staff",3]
[null,null,null,null,"Contact evaluation",4]
[null,null,null,null,"EMT",1]
[null,null,null,null,"IT support",1]
[null,null,null,null,"Total",{"$f":"SUM(F5:F12)+SUM(F14:F17)+1","v":61}]

{"sheet":"7. Results – Adding & Removing","index":8,"n_rows":14,"n_cols":10,"rows_kept":14,"cut":false,"hidden":false,"merged":[[33,1,33,2],[48,1,48,2],[2,6,3,9],[2,1,3,4]]}
["7. Results for Impact/Minus One & Impact/Plus One"]
[]
[null,"Impact on the Number of People Treated\nby Removing One Staff per Station per Shift",null,null,null,null,"Impact on the Number of People Treated\nby Adding One Staff per Station per Shift"]
[]
[null,"Station Description","Physicians","Nurses","Other Staff",null,"Station Description","Physicians","Nurses","Other Staff"]
[null,"Triage",{"$f":"'Results INDEX-MATCH'!C47","v":"na"},{"$f":"'Results INDEX-MATCH'!D47","v":-1109},{"$f":"'Results INDEX-MATCH'!E47","v":"na"},null,"Triage",{"$f":"'Results INDEX-MATCH'!C62","v":"na"},{"$f":"'Results INDEX-MATCH'!D62","v":202},{"$f":"'Results INDEX-MATCH'!E62","v":"na"}]
[null,"Orientation",{"$f":"'Results INDEX-MATCH'!C48","v":"na"},{"$f":"'Results INDEX-MATCH'!D48","v":"na"},{"$f":"'Results INDEX-MATCH'!E48","v":-235},null,"Orientation",{"$f":"'Results INDEX-MATCH'!C63","v":"na"},{"$f":"'Results INDEX-MATCH'!D63","v":"na"},{"$f":"'Results INDEX-MATCH'!E63","v":0}]
[null,"Medical froms help",{"$f":"'Results INDEX-MATCH'!C49","v":"na"},{"$f":"'Results INDEX-MATCH'!D49","v":"na"},{"$f":"'Results INDEX-MATCH'!E49","v":"NA"},null,"Medical froms help",{"$f":"'Results INDEX-MATCH'!C64","v":"na"},{"$f":"'Results INDEX-MATCH'!D64","v":"na"},{"$f":"'Results INDEX-MATCH'!E64","v":0}]
[null,"Referral",{"$f":"'Results INDEX-MATCH'!C50","v":"na"},{"$f":"'Results INDEX-MATCH'!D50","v":"na"},{"$f":"'Results INDEX-MATCH'!E50","v":-834},null,"Referral",{"$f":"'Results INDEX-MATCH'!C65","v":"na"},{"$f":"'Results INDEX-MATCH'!D65","v":"na"},{"$f":"'Results INDEX-MATCH'!E65","v":3}]
[null,"Medical screening",{"$f":"'Results INDEX-MATCH'!C51","v":"na"},{"$f":"'Results INDEX-MATCH'!D51","v":"NA"},{"$f":"'Results INDEX-MATCH'!E51","v":"na"},null,"Medical screening",{"$f":"'Results INDEX-MATCH'!C66","v":"na"},{"$f":"'Results INDEX-MATCH'!D66","v":-1},{"$f":"'Results INDEX-MATCH'!E66","v":"na"}]
[null,"Physician evaluation",{"$f":"'Results INDEX-MATCH'!C52","v":"NA"},{"$f":"'Results INDEX-MATCH'!D52","v":"na"},{"$f":"'Results INDEX-MATCH'!E52","v":"na"},null,"Physician evaluation",{"$f":"'Results INDEX-MATCH'!C67","v":8},{"$f":"'Results INDEX-MATCH'!D67","v":"na"},{"$f":"'Results INDEX-MATCH'!E67","v":"na"}]
[null,"Vaccination",{"$f":"'Results INDEX-MATCH'!C53","v":"na"},{"$f":"'Results INDEX-MATCH'!D53","v":-679},{"$f":"'Results INDEX-MATCH'!E53","v":"na"},null,"Vaccination",{"$f":"'Results INDEX-MATCH'!C68","v":"na"},{"$f":"'Results INDEX-MATCH'!D68","v":30},{"$f":"'Results INDEX-MATCH'!E68","v":"na"}]
[null,"Witness",{"$f":"'Results INDEX-MATCH'!C54","v":"na"},{"$f":"'Results INDEX-MATCH'!D54","v":-679},{"$f":"'Results INDEX-MATCH'!E54","v":"na"},null,"Witness",{"$f":"'Results INDEX-MATCH'!C69","v":"na"},{"$f":"'Results INDEX-MATCH'!D69","v":30},{"$f":"'Results INDEX-MATCH'!E69","v":"na"}]
[null,"Review/Exit",{"$f":"'Results INDEX-MATCH'!C55","v":"na"},{"$f":"'Results INDEX-MATCH'!D55","v":"NA"},{"$f":"'Results INDEX-MATCH'!E55","v":"na"},null,"Review/Exit",{"$f":"'Results INDEX-MATCH'!C70","v":"na"},{"$f":"'Results INDEX-MATCH'!D70","v":-33},{"$f":"'Results INDEX-MATCH'!E70","v":"na"}]

{"sheet":"Technical Appendix","index":9,"n_rows":36,"n_cols":23,"rows_kept":36,"cut":false,"hidden":false,"merged":[[23,14,24,17],[23,18,24,21],[23,22,24,25],[25,14,26,17],[25,18,26,21],[25,22,26,25],[19,14,20,17],[19,18,20,21],[19,22,20,25],[21,14,22,17],[21,18,22,21],[21,22,22,25],[15,14,16,17],[15,18,16,21],[15,22,16,25],[17,14,18,17],[17,18,18,21],[17,22,18,25],[11,14,12,17],[11,18,12,21],[11,22,12,25],[13,14,14,17],[13,18,14,21],[13,22,14,25],[2,14,3,25],[4,14,8,17],[4,18,8,21],[4,22,8,25],[9,14,10,17],[9,18,10,21],[9,22,10,25],[29,12,30,12],[31,12,32,12],[35,12,36,12],[29,1,30,11],[31,1,32,11],[33,1,34,11],[35,1,36,11],[33,12,34,12],[27,1,28,11],[19,1,20,12],[21,1,22,11],[21,12,22,12],[23,1,24,11],[25,1,26,11],[23,12,24,12],[25,12,26,12],[27,12,28,12]]}
["Technical Appendix"]
[]
[null,null,null,null,null,null,null,null,null,null,null,null,null,null,"Input Distributions*"]
[]
[null,null,null,null,null,null,null,null,null,null,null,null,null,null,"Process",null,null,null,"Version 1\nTriangular Distribution\n(Minimum, Most Likely, Maximum)\n(in minutes)",null,null,null,"Alternative Version (this version)\nTriangular Distribution\n(unless specified below)"]
[]
[]
[]
[]
[null,null,null,null,null,null,null,null,null,null,null,null,null,null,"Triage (per family member)",null,null,null,"(0.5, 1.0, 2.0)",null,null,null,"(0.5, 1.0, 2.0)"]
[]
[null,null,null,null,null,null,null,null,null,null,null,null,null,null,"Orientation",null,null,null,"(20, 25, 30)",null,null,null,"(13, 14, 15)"]
[]
[null,null,null,null,null,null,null,null,null,null,null,null,null,null,"Fill-out forms w/o help (per family member)",null,null,null,"(0.5, 1.0, 1.5)",null,null,null,"33 * BETA(0.518, 6.25)"]
[]
[null,null,null,null,null,null,null,null,null,null,null,null,null,null,"Fill-out forms w/ help (per family member)",null,null,null,"(0.3, 1.0, 1.5)",null,null,null,"33 * BETA(0.518, 6.25)"]
[]
[null,null,null,null,null,null,null,null,null,null,null,null,null,null,"Referral (per family member)",null,null,null,"(0.4, 0.5, 0.75)",null,null,null,"(0.4, 0.5, 0.75)"]
[]
[null,"Input Probabilities",null,null,null,null,null,null,null,null,null,null,null,null,"Medical screening (per family member)",null,null,null,"(5, 10, 15)",null,null,null,"-0.001 + LOGN(0.859, 0.508)"]
[]
[null,"Description",null,null,null,null,null,null,null,null,null,null,"Percent",null,"Physician evaluation",null,null,null,"(5, 10, 15)",null,null,null,"(0.1, 0.5, 0.75)"]
[]
[null,"Percent of families in which all have previously have been vaccinated*",null,null,null,null,null,null,null,null,null,null,2,null,"Exit review (per family member)",null,null,null,"(2, 3, 5)",null,null,null,"ERLA(0.0599,5)"]
[]
[null,"Percent symptomatic/contact (exit clinic); these families exit the clinic after being triaged",null,null,null,null,null,null,null,null,null,null,1,null,"Vaccination (per family member)",null,null,null,"(0.5, 1.0, 1.5)",null,null,null,"1 + ERLA(0.3, 2)"]
[]
[null,"Percent identified as not treatable at the clinic site; these families exit the clinic after being triaged",null,null,null,null,null,null,null,null,null,null,2]
[]
[null,"Percent of people who need help with filling out their medical/consent forms",null,null,null,null,null,null,null,null,null,null,2]
[]
[null,"Percent with complicating health factors; these families require additional medical screening beyond that given at the referral station",null,null,null,null,null,null,null,null,null,null,"20 or 40"]
[]
[null,"Percent with complicating health factors that are identified by the medical screener and who are not treatable on site; these families will exit\nthe clinic after seeing a medical screener and will exit the clinic before receiving a vaccination",null,null,null,null,null,null,null,null,null,null,10]
[]
[null,"Percent with complicating health factors that are identified by the physician evaluator and who are not treatable on site; these families will exit\nthe clinic after seeing the physician evaluator and will exit the clinic before receiving a vaccination",null,null,null,null,null,null,null,null,null,null,5]

{"sheet":"Clinic Flow","index":10,"n_rows":26,"n_cols":7,"rows_kept":26,"cut":false,"hidden":false,"merged":[]}
["Vaccination Site Flow Chart"]
[]
[]
[]
[]
[]
[]
[]
[]
[]
[]
[]
[]
[]
[]
[]
[]
[]
[]
[]
[]
[]
[]
[]
[]
[null,null,null,null,null,{"$f":"\"Average Time for Medical Screening: \"&'6. Results – Time & Auxiliary'!C10&\" min. (only \"&TEXT('3. % of Families'!K10,\"0%\")&\" of families)\"","v":"Average Time for Medical Screening: 4.161 min. (only 20% of families)"},{"$f":"\"Average Time for Physical Evaluation: \"&'6. Results – Time & Auxiliary'!C11&\" min. (only 10% of families)\"","v":"Average Time for Physical Evaluation: 48.236 min. (only 10% of families)"}]

{"sheet":"Results INDEX-MATCH","index":11,"n_rows":104,"n_cols":20,"rows_kept":104,"cut":false,"hidden":false,"merged":[[59,1,59,4],[74,1,74,2],[89,1,89,2],[9,0,9,4],[10,0,10,4],[11,0,11,4],[14,1,14,4],[29,1,29,4],[44,1,44,4]]}
[null,"Orientation",{"$f":"IF('2. Activities'!E8=0,\"*ERROR*\",'2. Activities'!E8)","v":"Yes"},{"$f":"IF(C1=\"Yes\",\"Y\",\"N\")","v":"Y"},null,null,null,null,null,null,null,null,null,"ID",{"$f":"_xlfn.CONCAT(D1,D2,C3,C4,C5,C6)","v":"YY1151020"}]
[null,"Witness",{"$f":"IF('2. Activities'!E17=0,\"*ERROR*\",'2. Activities'!E17)","v":"Yes"},{"$f":"IF(C2=\"Yes\",\"Y\",\"N\")","v":"Y"}]
[null,"Physicians",{"$f":"IF('1. Personnel'!I11=0,\"*ERROR*\",'1. Personnel'!I11)","v":1}]
[null,"Nurses",{"$f":"IF('1. Personnel'!I13=0,\"*ERROR*\",'1. Personnel'!I13)","v":15}]
[null,"Other Staff",{"$f":"IF('1. Personnel'!I15=0,\"*ERROR*\",'1. Personnel'!I15)","v":10}]
[null,"% of families",{"$f":"IF('3. % of Families'!K10=0,\"*ERROR*\",'3. % of Families'!K10)*100","v":20}]
[null,"UNIQUE ID",{"$f":"_xlfn.CONCAT(D1,D2,C3,C4,C5,C6)","v":"YY1151020"}]
[]
[]
["Total number of staff available per shift:",null,null,null,null,{"$f":"'1. Personnel'!I11+'1. Personnel'!I13+'1. Personnel'!I15","v":26}]
["Actual number of staff used per shift:",null,null,null,null,{"$f":"INDEX(Data_Modified!I$6:I$101,MATCH($C$7,Data_Modified!$G$6:$G$101,0))","v":19}]
["Maximum number of people that can be treated in a 24-hour period:",null,null,null,null,{"$f":"INDEX(Data_Modified!H$6:H$101,MATCH($C$7,Data_Modified!$G$6:$G$101,0))","v":3317}]
[]
[]
[null,"People Treated"]
[null,"Station Description","Physicians","Nurses","Other Staff",null,null,"Station Description","Triage Personnel","Orientation personnel","Medical form helper","Referral personnel","Medical screener","Physician Evaluator","Vaccinator","Witness","Exit review Personnel","Total"]
[null,"Triage Personnel",{"$f":"TRANSPOSE(I17:Q17)","v":"na"},{"$f":"TRANSPOSE(I18:Q18)","v":3},{"$f":"TRANSPOSE(I19:Q19)","v":"na"},null,null,"Physicians",{"$f":"INDEX(Data_Modified!J$6:J$101,MATCH($C$7,Data_Modified!$G$6:$G$101,0))","v":"na"},{"$f":"INDEX(Data_Modified!K$6:K$101,MATCH($C$7,Data_Modified!$G$6:$G$101,0))","v":"na"},{"$f":"INDEX(Data_Modified!L$6:L$101,MATCH($C$7,Data_Modified!$G$6:$G$101,0))","v":"na"},{"$f":"INDEX(Data_Modified!M$6:M$101,MATCH($C$7,Data_Modified!$G$6:$G$101,0))","v":"na"},{"$f":"INDEX(Data_Modified!N$6:N$101,MATCH($C$7,Data_Modified!$G$6:$G$101,0))","v":"na"},{"$f":"INDEX(Data_Modified!O$6:O$101,MATCH($C$7,Data_Modified!$G$6:$G$101,0))","v":1},{"$f":"INDEX(Data_Modified!P$6:P$101,MATCH($C$7,Data_Modified!$G$6:$G$101,0))","v":"na"},{"$f":"INDEX(Data_Modified!Q$6:Q$101,MATCH($C$7,Data_Modified!$G$6:$G$101,0))","v":"na"},{"$f":"INDEX(Data_Modified!R$6:R$101,MATCH($C$7,Data_Modified!$G$6:$G$101,0))","v":"na"},{"$f":"SUM(I17:Q17)","v":1}]
[null,"Orientation personnel","na","na",2,null,null,"Nurses",{"$f":"INDEX(Data_Modified!S$6:S$101,MATCH($C$7,Data_Modified!$G$6:$G$101,0))","v":3},{"$f":"INDEX(Data_Modified!T$6:T$101,MATCH($C$7,Data_Modified!$G$6:$G$101,0))","v":"na"},{"$f":"INDEX(Data_Modified!U$6:U$101,MATCH($C$7,Data_Modified!$G$6:$G$101,0))","v":"na"},{"$f":"INDEX(Data_Modified!V$6:V$101,MATCH($C$7,Data_Modified!$G$6:$G$101,0))","v":"na"},{"$f":"INDEX(Data_Modified!W$6:W$101,MATCH($C$7,Data_Modified!$G$6:$G$101,0))","v":2},{"$f":"INDEX(Data_Modified!X$6:X$101,MATCH($C$7,Data_Modified!$G$6:$G$101,0))","v":"na"},{"$f":"INDEX(Data_Modified!Y$6:Y$101,MATCH($C$7,Data_Modified!$G$6:$G$101,0))","v":4},{"$f":"INDEX(Data_Modified!Z$6:Z$101,MATCH($C$7,Data_Modified!$G$6:$G$101,0))","v":4},{"$f":"INDEX(Data_Modified!AA$6:AA$101,MATCH($C$7,Data_Modified!$G$6:$G$101,0))","v":1},{"$f":"SUM(I18:Q18)","v":14}]
[null,"Medical form helper","na","na",1,null,null,"Other Staff",{"$f":"INDEX(Data_Modified!AB$6:AB$101,MATCH($C$7,Data_Modified!$G$6:$G$101,0))","v":"na"},{"$f":"INDEX(Data_Modified!AC$6:AC$101,MATCH($C$7,Data_Modified!$G$6:$G$101,0))","v":2},{"$f":"INDEX(Data_Modified!AD$6:AD$101,MATCH($C$7,Data_Modified!$G$6:$G$101,0))","v":1},{"$f":"INDEX(Data_Modified!AE$6:AE$101,MATCH($C$7,Data_Modified!$G$6:$G$101,0))","v":1},{"$f":"INDEX(Data_Modified!AF$6:AF$101,MATCH($C$7,Data_Modified!$G$6:$G$101,0))","v":"na"},{"$f":"INDEX(Data_Modified!AG$6:AG$101,MATCH($C$7,Data_Modified!$G$6:$G$101,0))","v":"na"},{"$f":"INDEX(Data_Modified!AH$6:AH$101,MATCH($C$7,Data_Modified!$G$6:$G$101,0))","v":"na"},{"$f":"INDEX(Data_Modified!AI$6:AI$101,MATCH($C$7,Data_Modified!$G$6:$G$101,0))","v":"na"},{"$f":"INDEX(Data_Modified!AJ$6:AJ$101,MATCH($C$7,Data_Modified!$G$6:$G$101,0))","v":"na"}]
[null,"Referral personnel","na","na",1]
[null,"Medical screener","na",2,"na"]
[null,"Physician Evaluator",1,"na","na"]
[null,"Vaccinator","na",4,"na"]
[null,"Witness","na",4,"na"]
[null,"Exit review Personnel","na",1,"na"]
[null,"Total",{"$f":"SUM(C17:C25)","v":1},{"$f":"SUM(D17:D25)","v":14},{"$f":"SUM(E17:E25)","v":4}]
[]
[]
[]
[null,"Staff Utilization"]
[null,"Station Description","Physicians","Nurses","Other Staff",null,null,"Station Description","Triage personnel","Orientation personnel","Medical form helper","Referral personnel","Medical screener","Physician evaluator","Vaccinator","Witness","Exit review Personnel"]
[null,"Triage personnel",{"$f":"TRANSPOSE(I32:Q32)","v":"na"},{"$f":"TRANSPOSE(I33:Q33)","v":99.6},{"$f":"TRANSPOSE(I34:Q34)","v":"na"},null,null,"Physicians",{"$f":"INDEX(Data_Modified!AK$6:AK$101,MATCH($C$7,Data_Modified!$G$6:$G$101,0))","v":"na"},{"$f":"INDEX(Data_Modified!AL$6:AL$101,MATCH($C$7,Data_Modified!$G$6:$G$101,0))","v":"na"},{"$f":"INDEX(Data_Modified!AM$6:AM$101,MATCH($C$7,Data_Modified!$G$6:$G$101,0))","v":"na"},{"$f":"INDEX(Data_Modified!AN$6:AN$101,MATCH($C$7,Data_Modified!$G$6:$G$101,0))","v":"na"},{"$f":"INDEX(Data_Modified!AO$6:AO$101,MATCH($C$7,Data_Modified!$G$6:$G$101,0))","v":"na"},{"$f":"INDEX(Data_Modified!AP$6:AP$101,MATCH($C$7,Data_Modified!$G$6:$G$101,0))","v":45.1},{"$f":"INDEX(Data_Modified!AQ$6:AQ$101,MATCH($C$7,Data_Modified!$G$6:$G$101,0))","v":"na"},{"$f":"INDEX(Data_Modified!AR$6:AR$101,MATCH($C$7,Data_Modified!$G$6:$G$101,0))","v":"na"},{"$f":"INDEX(Data_Modified!AS$6:AS$101,MATCH($C$7,Data_Modified!$G$6:$G$101,0))","v":"na"}]
[null,"Orientation personnel","na","na",53.5,null,null,"Nurses",{"$f":"INDEX(Data_Modified!AT$6:AT$101,MATCH($C$7,Data_Modified!$G$6:$G$101,0))","v":99.6},{"$f":"INDEX(Data_Modified!AU$6:AU$101,MATCH($C$7,Data_Modified!$G$6:$G$101,0))","v":"na"},{"$f":"INDEX(Data_Modified!AV$6:AV$101,MATCH($C$7,Data_Modified!$G$6:$G$101,0))","v":"na"},{"$f":"INDEX(Data_Modified!AW$6:AW$101,MATCH($C$7,Data_Modified!$G$6:$G$101,0))","v":"na"},{"$f":"INDEX(Data_Modified!AX$6:AX$101,MATCH($C$7,Data_Modified!$G$6:$G$101,0))","v":38.700000000000003},{"$f":"INDEX(Data_Modified!AY$6:AY$101,MATCH($C$7,Data_Modified!$G$6:$G$101,0))","v":"na"},{"$f":"INDEX(Data_Modified!AZ$6:AZ$101,MATCH($C$7,Data_Modified!$G$6:$G$101,0))","v":92.3},{"$f":"INDEX(Data_Modified!BA$6:BA$101,MATCH($C$7,Data_Modified!$G$6:$G$101,0))","v":92.3},{"$f":"INDEX(Data_Modified!BB$6:BB$101,MATCH($C$7,Data_Modified!$G$6:$G$101,0))","v":18.7}]
[null,"Medical form helper","na","na",11.3,null,null,"Other Staff",{"$f":"INDEX(Data_Modified!BC$6:BC$101,MATCH($C$7,Data_Modified!$G$6:$G$101,0))","v":"na"},{"$f":"INDEX(Data_Modified!BD$6:BD$101,MATCH($C$7,Data_Modified!$G$6:$G$101,0))","v":53.5},{"$f":"INDEX(Data_Modified!BE$6:BE$101,MATCH($C$7,Data_Modified!$G$6:$G$101,0))","v":11.3},{"$f":"INDEX(Data_Modified!BF$6:BF$101,MATCH($C$7,Data_Modified!$G$6:$G$101,0))","v":65.3},{"$f":"INDEX(Data_Modified!BG$6:BG$101,MATCH($C$7,Data_Modified!$G$6:$G$101,0))","v":"na"},{"$f":"INDEX(Data_Modified!BH$6:BH$101,MATCH($C$7,Data_Modified!$G$6:$G$101,0))","v":"na"},{"$f":"INDEX(Data_Modified!BI$6:BI$101,MATCH($C$7,Data_Modified!$G$6:$G$101,0))","v":"na"},{"$f":"INDEX(Data_Modified!BJ$6:BJ$101,MATCH($C$7,Data_Modified!$G$6:$G$101,0))","v":"na"},{"$f":"INDEX(Data_Modified!BK$6:BK$101,MATCH($C$7,Data_Modified!$G$6:$G$101,0))","v":"na"}]
[null,"Referral personnel","na","na",65.3]
[null,"Medical screener","na",38.700000000000003,"na"]
[null,"Physician evaluator",45.1,"na","na"]
[null,"Vaccinator","na",92.3,"na"]
[null,"Witness","na",92.3,"na"]
[null,"Exit review Personnel","na",18.7,"na"]
[]
[]
[]
[]
[null,"Impact/Minus One"]
[null,"Station Description","Physicians","Nurses","Other Staff"]
[null,"Triage",{"$f":"TRANSPOSE(I48:Q48)","v":"na"},{"$f":"TRANSPOSE(I49:Q49)","v":-1109},{"$f":"TRANSPOSE(I50:Q50)","v":"na"},null,null,"Station Description","Triage","Orientation","Medical froms help","Referral","Medical screening","Physician evaluation","Vaccination","Witness","Review/Exit"]
[null,"Orientation","na","na",-235,null,null,"Physicians",{"$f":"INDEX(Data_Modified!CM$6:CM$101,MATCH($C$7,Data_Modified!$G$6:$G$101,0))","v":"na"},{"$f":"INDEX(Data_Modified!CN$6:CN$101,MATCH($C$7,Data_Modified!$G$6:$G$101,0))","v":"na"},{"$f":"INDEX(Data_Modified!CO$6:CO$101,MATCH($C$7,Data_Modified!$G$6:$G$101,0))","v":"na"},{"$f":"INDEX(Data_Modified!CP$6:CP$101,MATCH($C$7,Data_Modified!$G$6:$G$101,0))","v":"na"},{"$f":"INDEX(Data_Modified!CQ$6:CQ$101,MATCH($C$7,Data_Modified!$G$6:$G$101,0))","v":"na"},{"$f":"INDEX(Data_Modified!CR$6:CR$101,MATCH($C$7,Data_Modified!$G$6:$G$101,0))","v":"NA"},{"$f":"INDEX(Data_Modified!CS$6:CS$101,MATCH($C$7,Data_Modified!$G$6:$G$101,0))","v":"na"},{"$f":"INDEX(Data_Modified!CT$6:CT$101,MATCH($C$7,Data_Modified!$G$6:$G$101,0))","v":"na"},{"$f":"INDEX(Data_Modified!CU$6:CU$101,MATCH($C$7,Data_Modified!$G$6:$G$101,0))","v":"na"}]
[null,"Medical froms help","na","na","NA",null,null,"Nurses",{"$f":"INDEX(Data_Modified!CV$6:CV$101,MATCH($C$7,Data_Modified!$G$6:$G$101,0))","v":-1109},{"$f":"INDEX(Data_Modified!CW$6:CW$101,MATCH($C$7,Data_Modified!$G$6:$G$101,0))","v":"na"},{"$f":"INDEX(Data_Modified!CX$6:CX$101,MATCH($C$7,Data_Modified!$G$6:$G$101,0))","v":"na"},{"$f":"INDEX(Data_Modified!CY$6:CY$101,MATCH($C$7,Data_Modified!$G$6:$G$101,0))","v":"na"},{"$f":"INDEX(Data_Modified!CZ$6:CZ$101,MATCH($C$7,Data_Modified!$G$6:$G$101,0))","v":"NA"},{"$f":"INDEX(Data_Modified!DA$6:DA$101,MATCH($C$7,Data_Modified!$G$6:$G$101,0))","v":"na"},{"$f":"INDEX(Data_Modified!DB$6:DB$101,MATCH($C$7,Data_Modified!$G$6:$G$101,0))","v":-679},{"$f":"INDEX(Data_Modified!DC$6:DC$101,MATCH($C$7,Data_Modified!$G$6:$G$101,0))","v":-679},{"$f":"INDEX(Data_Modified!DD$6:DD$101,MATCH($C$7,Data_Modified!$G$6:$G$101,0))","v":"NA"}]
[null,"Referral","na","na",-834,null,null,"Other Staff",{"$f":"INDEX(Data_Modified!DE$6:DE$101,MATCH($C$7,Data_Modified!$G$6:$G$101,0))","v":"na"},{"$f":"INDEX(Data_Modified!DF$6:DF$101,MATCH($C$7,Data_Modified!$G$6:$G$101,0))","v":-235},{"$f":"INDEX(Data_Modified!DG$6:DG$101,MATCH($C$7,Data_Modified!$G$6:$G$101,0))","v":"NA"},{"$f":"INDEX(Data_Modified!DH$6:DH$101,MATCH($C$7,Data_Modified!$G$6:$G$101,0))","v":-834},{"$f":"INDEX(Data_Modified!DI$6:DI$101,MATCH($C$7,Data_Modified!$G$6:$G$101,0))","v":"na"},{"$f":"INDEX(Data_Modified!DJ$6:DJ$101,MATCH($C$7,Data_Modified!$G$6:$G$101,0))","v":"na"},{"$f":"INDEX(Data_Modified!DK$6:DK$101,MATCH($C$7,Data_Modified!$G$6:$G$101,0))","v":"na"},{"$f":"INDEX(Data_Modified!DL$6:DL$101,MATCH($C$7,Data_Modified!$G$6:$G$101,0))","v":"na"},{"$f":"INDEX(Data_Modified!DM$6:DM$101,MATCH($C$7,Data_Modified!$G$6:$G$101,0))","v":"na"}]
[null,"Medical screening","na","NA","na"]
[null,"Physician evaluation","NA","na","na"]
[null,"Vaccination","na",-679,"na"]
[null,"Witness","na",-679,"na"]
[null,"Review/Exit","na","NA","na"]
[]
[]
[]
[]
[null,"Impact/Plus One"]
[null,"Station Description","Physicians","Nurses","Other Staff",null,null,"Station Description","Triage","Orientation","Medical froms help","Referral","Medical screening","Physician evaluation","Vaccination","Witness","Review/Exit"]
[null,"Triage",{"$f":"TRANSPOSE(I62:Q62)","v":"na"},{"$f":"TRANSPOSE(I63:Q63)","v":202},{"$f":"TRANSPOSE(I64:Q64)","v":"na"},null,null,"Physicians",{"$f":"INDEX(Data_Modified!BL$6:BL$101,MATCH($C$7,Data_Modified!$G$6:$G$101,0))","v":"na"},{"$f":"INDEX(Data_Modified!BM$6:BM$101,MATCH($C$7,Data_Modified!$G$6:$G$101,0))","v":"na"},{"$f":"INDEX(Data_Modified!BN$6:BN$101,MATCH($C$7,Data_Modified!$G$6:$G$101,0))","v":"na"},{"$f":"INDEX(Data_Modified!BO$6:BO$101,MATCH($C$7,Data_Modified!$G$6:$G$101,0))","v":"na"},{"$f":"INDEX(Data_Modified!BP$6:BP$101,MATCH($C$7,Data_Modified!$G$6:$G$101,0))","v":"na"},{"$f":"INDEX(Data_Modified!BQ$6:BQ$101,MATCH($C$7,Data_Modified!$G$6:$G$101,0))","v":8},{"$f":"INDEX(Data_Modified!BR$6:BR$101,MATCH($C$7,Data_Modified!$G$6:$G$101,0))","v":"na"},{"$f":"INDEX(Data_Modified!BS$6:BS$101,MATCH($C$7,Data_Modified!$G$6:$G$101,0))","v":"na"},{"$f":"INDEX(Data_Modified!BT$6:BT$101,MATCH($C$7,Data_Modified!$G$6:$G$101,0))","v":"na"}]
[null,"Orientation","na","na",0,null,null,"Nurses",{"$f":"INDEX(Data_Modified!BU$6:BU$101,MATCH($C$7,Data_Modified!$G$6:$G$101,0))","v":202},{"$f":"INDEX(Data_Modified!BV$6:BV$101,MATCH($C$7,Data_Modified!$G$6:$G$101,0))","v":"na"},{"$f":"INDEX(Data_Modified!BW$6:BW$101,MATCH($C$7,Data_Modified!$G$6:$G$101,0))","v":"na"},{"$f":"INDEX(Data_Modified!BX$6:BX$101,MATCH($C$7,Data_Modified!$G$6:$G$101,0))","v":"na"},{"$f":"INDEX(Data_Modified!BY$6:BY$101,MATCH($C$7,Data_Modified!$G$6:$G$101,0))","v":-1},{"$f":"INDEX(Data_Modified!BZ$6:BZ$101,MATCH($C$7,Data_Modified!$G$6:$G$101,0))","v":"na"},{"$f":"INDEX(Data_Modified!CA$6:CA$101,MATCH($C$7,Data_Modified!$G$6:$G$101,0))","v":30},{"$f":"INDEX(Data_Modified!CB$6:CB$101,MATCH($C$7,Data_Modified!$G$6:$G$101,0))","v":30},{"$f":"INDEX(Data_Modified!CC$6:CC$101,MATCH($C$7,Data_Modified!$G$6:$G$101,0))","v":-33}]
[null,"Medical froms help","na","na",0,null,null,"Other Staff",{"$f":"INDEX(Data_Modified!CD$6:CD$101,MATCH($C$7,Data_Modified!$G$6:$G$101,0))","v":"na"},{"$f":"INDEX(Data_Modified!CE$6:CE$101,MATCH($C$7,Data_Modified!$G$6:$G$101,0))","v":0},{"$f":"INDEX(Data_Modified!CF$6:CF$101,MATCH($C$7,Data_Modified!$G$6:$G$101,0))","v":0},{"$f":"INDEX(Data_Modified!CG$6:CG$101,MATCH($C$7,Data_Modified!$G$6:$G$101,0))","v":3},{"$f":"INDEX(Data_Modified!CH$6:CH$101,MATCH($C$7,Data_Modified!$G$6:$G$101,0))","v":"na"},{"$f":"INDEX(Data_Modified!CI$6:CI$101,MATCH($C$7,Data_Modified!$G$6:$G$101,0))","v":"na"},{"$f":"INDEX(Data_Modified!CJ$6:CJ$101,MATCH($C$7,Data_Modified!$G$6:$G$101,0))","v":"na"},{"$f":"INDEX(Data_Modified!CK$6:CK$101,MATCH($C$7,Data_Modified!$G$6:$G$101,0))","v":"na"},{"$f":"INDEX(Data_Modified!CL$6:CL$101,MATCH($C$7,Data_Modified!$G$6:$G$101,0))","v":"na"}]
[null,"Referral","na","na",3]
[null,"Medical screening","na",-1,"na"]
[null,"Physician evaluation",8,"na","na"]
[null,"Vaccination","na",30,"na"]
[null,"Witness","na",30,"na"]
[null,"Review/Exit","na",-33,"na"]
[]
[]
[]
[]
[null,"Average Time Spent"]
[null,"Station Description","Average time",null,null,null,null,"Station Description","Triage","Orientation","Medical froms help","Referral","Medical screening","Physician evaluation","Vaccination","Witness","Review/Exit"]
[null,"Triage",{"$f":"TRANSPOSE(I77:Q77)","v":4.32},null,null,null,null,"Average time",{"$f":"INDEX(Data_Modified!DN$6:DN$101,MATCH($C$7,Data_Modified!$G$6:$G$101,0))","v":4.32},{"$f":"INDEX(Data_Modified!DO$6:DO$101,MATCH($C$7,Data_Modified!$G$6:$G$101,0))","v":19.821000000000002},{"$f":"INDEX(Data_Modified!DP$6:DP$101,MATCH($C$7,Data_Modified!$G$6:$G$101,0))","v":12.292999999999999},{"$f":"INDEX(Data_Modified!DQ$6:DQ$101,MATCH($C$7,Data_Modified!$G$6:$G$101,0))","v":2.984},{"$f":"INDEX(Data_Modified!DR$6:DR$101,MATCH($C$7,Data_Modified!$G$6:$G$101,0))","v":4.1609999999999996},{"$f":"INDEX(Data_Modified!DS$6:DS$101,MATCH($C$7,Data_Modified!$G$6:$G$101,0))","v":48.235999999999997},{"$f":"INDEX(Data_Modified!DT$6:DT$101,MATCH($C$7,Data_Modified!$G$6:$G$101,0))","v":10.879},{"$f":"INDEX(Data_Modified!DU$6:DU$101,MATCH($C$7,Data_Modified!$G$6:$G$101,0))","v":10.879},{"$f":"INDEX(Data_Modified!DV$6:DV$101,MATCH($C$7,Data_Modified!$G$6:$G$101,0))","v":0.33}]
[null,"Orientation",19.821000000000002]
[null,"Medical froms help",12.292999999999999]
[null,"Referral",2.984]
[null,"Medical screening",4.1609999999999996]
[null,"Physician evaluation",48.235999999999997]
[null,"Vaccination",10.879]
[null,"Witness",10.879]
[null,"Review/Exit",0.33]
[]
[]
[]
[]
[null,"Others"]
[null,"Station Description","Number per shiift",null,null,null,"Station Description","Form distribution","Vaccine preparation","Medical records data","Clinic manager","Supply manager","Clinic QA reviewer","Security","Traffic flow","Translator","Float staff","Contact evaluation","EMT","IT support"]
[null,"Form distribution",null,null,null,null,"Number per shiift"]
[null,"Vaccine preparation"]
[null,"Medical records data"]
[null,"Clinic manager"]
[null,"Supply manager"]
[null,"Clinic QA reviewer"]
[null,"Security"]
[null,"Traffic flow"]
[null,"Translator"]
[null,"Float staff"]
[null,"Contact evaluation"]
[null,"EMT"]
[null,"IT support"]

{"sheet":"Data_Modified","index":12,"n_rows":101,"n_cols":126,"rows_kept":101,"cut":false,"hidden":false,"merged":[[2,99,2,107],[2,108,2,116],[2,117,2,125],[3,2,3,6],[2,9,2,17],[2,18,2,26],[2,27,2,35],[2,36,2,44],[2,45,2,53],[2,54,2,62],[2,63,2,71],[2,72,2,80],[2,81,2,89],[2,90,2,98],[1,90,1,98],[1,108,1,116],[1,9,1,17],[1,18,1,26],[1,27,1,35],[1,36,1,44],[1,45,1,53],[1,54,1,62],[1,63,1,71],[1,72,1,80],[1,81,1,89],[1,99,1,107]]}
[null,null,null,null,null,null,null,"  RESULTS     RESULTS    RESULTS   RESULTS   RESULTS   RESULTS   RESULTS   RESULTS   RESULTS   RESULTS     RESULTS    RESULTS   RESULTS   RESULTS   RESULTS   RESULTS   RESULTS   RESULTS   RESULTS     RESULTS    RESULTS   RESULTS   RESULTS   RESULTS   RESULTS   RESULTS   RESULTS  RESULTS     RESULTS    RESULTS   RESULTS   RESULTS   RESULTS   RESULTS   RESULTS   RESULTS  RESULTS     RESULTS    RESULTS   RESULTS   RESULTS   RESULTS   RESULTS   RESULTS   RESULTS  "]
[null,null,null,null,null,null,null,null,null,"PHYSICIANS",null,null,null,null,null,null,null,null,"NURSES",null,null,null,null,null,null,null,null,"OTHER",null,null,null,null,null,null,null,null,"PHYSICIANS",null,null,null,null,null,null,null,null,"NURSES",null,null,null,null,null,null,null,null,"OTHER",null,null,null,null,null,null,null,null,"PHYSICIANS",null,null,null,null,null,null,null,null,"NURSES",null,null,null,null,null,null,null,null,"OTHER",null,null,null,null,null,null,null,null,"PHYSICIANS",null,null,null,null,null,null,null,null,"NURSES",null,null,null,null,null,null,null,null,"OTHER"]
[null,null,"CONSTRAINTS",null,null,null,null,null,null,"Output (# at Station)",null,null,null,null,null,null,null,null,"Output (# at Station)",null,null,null,null,null,null,null,null,"Output (# at Station)",null,null,null,null,null,null,null,null,"Output (% Time Busy)",null,null,null,null,null,null,null,null,"Output (% Time Busy)",null,null,null,null,null,null,null,null,"Output (% Time Busy)",null,null,null,null,null,null,null,null,"Impact of Adding One Resource                                 (Change in Number of People Vaccinated)",null,null,null,null,null,null,null,null,"Impact of Adding One Resource                                 (Change in Number of People Vaccinated)",null,null,null,null,null,null,null,null,"Impact of Adding One Resource                                (Change in Number of People Vaccinated)",null,null,null,null,null,null,null,null,"Impact of Removing One Resource                                 (Change in Number of People Vaccinated)",null,null,null,null,null,null,null,null,"Impact of Removing One Resource                                 (Change in Number of People Vaccinated)",null,null,null,null,null,null,null,null,"Impact of Removing One Resource                           (Change in Number of People Vaccinated)",null,null,null,null,null,null,null,null,"Average Time Families Spend At Each Station   (Minutes)"]
[null,null,"Personnel Type and Orientation Room Size",null,null,null,null,"MAIN"]
["Orientation","Witness","Physican","Medical Prof","Other","Complications by initial reviewer\nDecideComp (%)","Unique Identifier","People Vaccinated","Total Staff Used","Triage Personnel","Orientation Personnel","Medical Form Helper","Referral Personnel","Medical Screener","Physician Evaluator","Vaccinator","Witnesses","Exit Review Personnel","Triage Personnel","Orientation Personnel","Medical Form Helper","Referral Personnel","Medical Screener","Physician Evaluator","Vaccinator","Witnesses","Exit Review Personnel","Triage Personnel","Orientation Personnel","Medical Form Helper","Referral Personnel","Medical Screener","Physician Evaluator","Vaccinator","Witnesses","Exit Review Personnel","Triage Personnel","Orientation Personnel","Medical Form Helper","Referral Personnel","Medical Screener","Physician Evaluator","Vaccinator","Witnesses","Exit Review Personnel","Triage Personnel","Orientation Personnel","Medical Form Helper","Referral Personnel","Medical Screener","Physician Evaluator","Vaccinator","Witnesses","Exit Review Personnel","Triage Personel","Orientation Personnel","Medical Form Helper","Referral Personnel","Medical Screener","Physician Evaluator","Vaccinator","Witnesses","Exit Review Personnel","Triage Personnel","Orientation Personnel","Medical Form Helper","Referral Personnel","Medical Screener","Physician Evaluator","Vaccinator","Witnesses","Exit Review Personnel","Triage Personnel","Orientation Personnel","Medical Form Helper","Referral Personnel","Medical Screener","Physician Evaluator","Vaccinator","Witnesses","Exit Review Personnel","Triage Personnel","Orientation Personnel","Medical Form Helper","Referral Personnel","Medical Screener","Physician Evaluator","Vaccinator","Witnesses","Exit Review Personnel","Triage Personnel","Orientation Personnel","Medical Form Helper","Referral Personnel","Medical Screener","Physician Evaluator","Vaccinator","Witnesses","Exit Review Personnel","Triage Personnel","Orientation Personnel","Medical Form Helper","Referral Personnel","Medical Screener","Physician Evaluator","Vaccinator","Witnesses","Exit Review Personnel","Triage Personnel","Orientation Personnel","Medical Form Helper","Referral Personnel","Medical Screener","Physician Evaluator","Vaccinator","Witnesses","Exit Review Personnel","Triage ","Orientation ","Medical Forms","Referral ","Medical Screening","Physician Evaluation","Vaccinator","Witnesses","Exit Review Personnel"]
["Y","Y",1,5,5,20,{"$f":"_xlfn.CONCAT(A6,B6,C6,D6,E6,F6)","v":"YY15520"},871,{"$f":"O6+S6+W6+Y6+Z6+AA6+AC6+ AD6+AE6","v":9},"na","na","na","na","na",1,"na","na","na",1,"na","na","na",1,"na",1,1,1,"na",1,1,1,"na","na","na","na","na","na","na","na","na","na",15.7,"na","na","na",100,"na","na","na",14.9,"na",96,96,4.9000000000000004,"na",35.700000000000003,3.4,43.6,"na","na","na","na","na","na","na","na","na","na",-6,"na","na","na",-2,"na","na","na",-8,"na",230,230,0,"na",0,8,4,"na","na","na","na","na","na","na","na","na","na","NA","na","na","na",-8,"na","na","na","NA","na","NA","NA","NA","na","NA","NA","NA","na","na","na","na","na",4.2320000000000002,31.247,11.143000000000001,4.2329999999999997,3.81,36.994,162.46899999999999,162.46899999999999,0.29399999999999998]
["Y","Y",3,5,5,20,{"$f":"_xlfn.CONCAT(A7,B7,C7,D7,E7,F7)","v":"YY35520"},871,{"$f":"O7+S7+W7+Y7+Z7+AA7+AC7+ AD7+AE7","v":9},"na","na","na","na","na",1,"na","na","na",1,"na","na","na",1,"na",1,1,1,"na",1,1,1,"na","na","na","na","na","na","na","na","na","na",15.7,"na","na","na",100,"na","na","na",14.9,"na",96,96,4.9000000000000004,"na",35.700000000000003,3.4,43.6,"na","na","na","na","na","na","na","na","na","na",-6,"na","na","na",-2,"na","na","na",-8,"na",230,230,0,"na",0,8,4,"na","na","na","na","na","na","na","na","na","na","NA","na","na","na",-8,"na","na","na","NA","na","NA","NA","NA","na","NA","NA","NA","na","na","na","na","na",4.2320000000000002,31.247,11.143000000000001,4.2329999999999997,3.81,36.994,162.46899999999999,162.46899999999999,0.29399999999999998]
["Y","Y",1,15,5,20,"YY115520",3317,19,"na","na","na","na","na",1,"na","na","na",3,"na","na","na",2,"na",4,4,1,"na",2,1,1,"na","na","na","na","na","na","na","na","na","na",45.1,"na","na","na",99.6,"na","na","na",38.700000000000003,"na",92.3,92.3,18.7,"na",53.5,11.3,65.3,"na","na","na","na","na","na","na","na","na","na",8,"na","na","na",202,"na","na","na",-1,"na",30,30,-33,"na",0,0,3,"na","na","na","na","na","na","na","na","na","na","NA","na","na","na",-1109,"na","na","na","NA","na",-679,-679,"NA","na",-235,"NA",-834,"na","na","na","na","na",4.32,19.821000000000002,12.292999999999999,2.984,4.1609999999999996,48.235999999999997,10.879,10.879,0.33]
["Y","Y",3,15,5,20,"YY315520",3317,{"$f":"O9+S9+W9+Y9+Z9+AA9+AC9+ AD9+AE9","v":19},"na","na","na","na","na",1,"na","na","na",3,"na","na","na",2,"na",4,4,1,"na",2,1,1,"na","na","na","na","na","na","na","na","na","na",45.1,"na","na","na",99.6,"na","na","na",38.700000000000003,"na",92.3,92.3,18.7,"na",53.5,11.3,65.3,"na","na","na","na","na","na","na","na","na","na",8,"na","na","na",202,"na","na","na",-1,"na",30,30,-33,"na",0,0,3,"na","na","na","na","na","na","na","na","na","na","NA","na","na","na",-1109,"na","na","na","NA","na",-679,-679,"NA","na",-235,"NA",-834,"na","na","na","na","na",4.32,19.821000000000002,12.292999999999999,2.984,4.1609999999999996,48.235999999999997,10.879,10.879,0.33]
["Y","Y",1,30,5,20,"YY130520",4403,24,"na","na","na","na","na",1,"na","na","na",4,"na","na","na",2,"na",6,6,1,"na",2,1,1,"na","na","na","na","na","na","na","na","na","na",63,"na","na","na",99.5,"na","na","na",53.1,"na",81.5,81.5,25.4,"na",71,12.8,86.8,"na","na","na","na","na","na","na","na","na","na",-5,"na","na","na",565,"na","na","na",-1,"na",-11,-11,39,"na",0,-27,36,"na","na","na","na","na","na","na","na","na","na","NA","na","na","na",-1085,"na","na","na","NA","na",-73,-73,"NA","na",-1321,"NA",-1889,"na","na","na","na","na",4.2590000000000003,18.375,10.045999999999999,4.3410000000000002,5.0860000000000003,72.263000000000005,6.45,6.45,0.35099999999999998]
["Y","Y",3,30,5,20,"YY330520",4403,24,"na","na","na","na","na",1,"na","na","na",4,"na","na","na",2,"na",6,6,1,"na",2,1,1,"na","na","na","na","na","na","na","na","na","na",63,"na","na","na",99.5,"na","na","na",53.1,"na",81.5,81.5,25.4,"na",71,12.8,86.8,"na","na","na","na","na","na","na","na","na","na",-5,"na","na","na",565,"na","na","na",-1,"na",-11,-11,39,"na",0,-27,36,"na","na","na","na","na","na","na","na","na","na","NA","na","na","na",-1085,"na","na","na","NA","na",-73,-73,"NA","na",-1321,"NA",-1889,"na","na","na","na","na",4.2590000000000003,18.375,10.045999999999999,4.3410000000000002,5.0860000000000003,72.263000000000005,6.45,6.45,0.35099999999999998]
["Y","Y",1,5,10,20,"YY151020",871,9,"na","na","na","na","na",1,"na","na","na",1,"na","na","na",1,"na",1,1,1,"na",1,1,1,"na","na","na","na","na","na","na","na","na","na",15.7,"na","na","na",100,"na","na","na",14.9,"na",96,96,4.9000000000000004,"na",35.700000000000003,3.4,43.6,"na","na","na","na","na","na","na","na","na","na",-6,"na","na","na",-2,"na","na","na",-8,"na",230,230,0,"na",0,8,4,"na","na","na","na","na","na","na","na","na","na","NA","na","na","na","NA","na","na","na","NA","na","NA","NA","NA","na","NA","NA","NA","na","na","na","na","na",4.2320000000000002,31.247,11.143000000000001,4.2329999999999997,3.81,36.994,162.46899999999999,162.46899999999999,0.29399999999999998]
["Y","Y",3,5,10,20,"YY351020",871,9,"na","na","na","na","na",1,"na","na","na",1,"na","na","na",1,"na",1,1,1,"na",1,1,1,"na","na","na","na","na","na","na","na","na","na",15.7,"na","na","na",100,"na","na","na",14.9,"na",96,96,4.9000000000000004,"na",35.700000000000003,3.4,43.6,"na","na","na","na","na","na","na","na","na","na",-6,"na","na","na",-2,"na","na","na",-8,"na",230,230,0,"na",0,8,4,"na","na","na","na","na","na","na","na","na","na","NA","na","na","na","NA","na","na","na","NA","na","NA","NA","NA","na","NA","NA","NA","na","na","na","na","na",4.2320000000000002,31.247,11.143000000000001,4.2329999999999997,3.81,36.994,162.46899999999999,162.46899999999999,0.29399999999999998]
["Y","Y",1,15,10,20,"YY1151020",3317,19,"na","na","na","na","na",1,"na","na","na",3,"na","na","na",2,"na",4,4,1,"na",2,1,1,"na","na","na","na","na","na","na","na","na","na",45.1,"na","na","na",99.6,"na","na","na",38.700000000000003,"na",92.3,92.3,18.7,"na",53.5,11.3,65.3,"na","na","na","na","na","na","na","na","na","na",8,"na","na","na",202,"na","na","na",-1,"na",30,30,-33,"na",0,0,3,"na","na","na","na","na","na","na","na","na","na","NA","na","na","na",-1109,"na","na","na","NA","na",-679,-679,"NA","na",-235,"NA",-834,"na","na","na","na","na",4.32,19.821000000000002,12.292999999999999,2.984,4.1609999999999996,48.235999999999997,10.879,10.879,0.33]
["Y","Y",3,15,10,20,"YY3151020",3317,19,"na","na","na","na","na",1,"na","na","na",3,"na","na","na",2,"na",4,4,1,"na",2,1,1,"na","na","na","na","na","na","na","na","na","na",45.1,"na","na","na",99.6,"na","na","na",38.700000000000003,"na",92.3,92.3,18.7,"na",53.5,11.3,65.3,"na","na","na","na","na","na","na","na","na","na",8,"na","na","na",202,"na","na","na",-1,"na",30,30,-33,"na",0,0,3,"na","na","na","na","na","na","na","na","na","na","NA","na","na","na",-1109,"na","na","na","NA","na",-679,-679,"NA","na",-235,"NA",-834,"na","na","na","na","na",4.32,19.821000000000002,12.292999999999999,2.984,4.1609999999999996,48.235999999999997,10.879,10.879,0.33]
["Y","Y",1,30,10,20,"YY1301020",7898.8,39,"na","na","na","na","na",1,"na","na","na",8,"na","na","na",5,"na",9,9,2,"na",3,1,1,"na","na","na","na","na","na","na","na","na","na",84.2,"na","na","na",98.9,"na","na","na",96.4,"na",97.6,97.6,22.6,"na",94.6,30.6,69.5,"na","na","na","na","na","na","na","na","na","na",42,"na","na","na",24,"na","na","na",23,"na",702,702,34,"na",-5,24,39,"na","na","na","na","na","na","na","na","na","na","NA","na","na","na",-246,"na","na","na","NA","na",-855,-855,16,"na",-1740,"NA",19,"na","na","na","na","na",4.2450000000000001,16.771999999999998,15.37,2.2549999999999999,90.528000000000006,125.77,65.826999999999998,65.826999999999998,0.308]
["Y","Y",3,30,10,20,"YY3301020",7898.8,39,"na","na","na","na","na",1,"na","na","na",8,"na","na","na",5,"na",9,9,2,"na",3,1,1,"na","na","na","na","na","na","na","na","na","na",84.2,"na","na","na",98.9,"na","na","na",96.4,"na",97.6,97.6,22.6,"na",94.6,30.6,69.5,"na","na","na","na","na","na","na","na","na","na",42,"na","na","na",24,"na","na","na",23,"na",702,702,34,"na",-5,24,39,"na","na","na","na","na","na","na","na","na","na","NA","na","na","na",-246,"na","na","na","NA","na",-855,-855,16,"na",-1740,"NA",19,"na","na","na","na","na",4.2450000000000001,16.771999999999998,15.37,2.2549999999999999,90.528000000000006,125.77,65.826999999999998,65.826999999999998,0.308]
["Y","Y",1,5,5,40,"YY15540",40,9,"na","na","na","na","na",1,"na","na","na",1,"na","na","na",1,"na",1,1,1,"na",1,1,1,"na","na","na","na","na","na","na","na","na","na",33.799999999999997,"na","na","na",100,"na","na","na",27.6,"na",95.7,95.7,5,"na",35.299999999999997,3.8,43,"na","na","na","na","na","na","na","na","na","na",3,"na","na","na",10,"na","na","na",-7,"na",200,200,0,"na",0,-2,-10,"na","na","na","na","na","na","na","na","na","na","NA","na","na","na","NA","na","na","na","NA","na","NA","NA","NA","na","NA","NA","NA","na","na","na","na","na",4.2949999999999999,31.606999999999999,8.8409999999999993,4.0599999999999996,4.1619999999999999,45.584000000000003,143.077,143.077,0.29899999999999999]
["Y","Y",3,5,5,40,"YY35540",868,9,"na","na","na","na","na",1,"na","na","na",1,"na","na","na",1,"na",1,1,1,"na",1,1,1,"na","na","na","na","na","na","na","na","na","na",33.799999999999997,"na","na","na",100,"na","na","na",27.6,"na",95.7,95.7,5,"na",35.299999999999997,3.8,43,"na","na","na","na","na","na","na","na","na","na",3,"na","na","na",10,"na","na","na",-7,"na",200,200,0,"na",0,-2,-10,"na","na","na","na","na","na","na","na","na","na","NA","na","na","na","NA","na","na","na","NA","na","NA","NA","NA","na","NA","NA","NA","na","na","na","na","na",4.2949999999999999,31.606999999999999,8.8409999999999993,4.0599999999999996,4.1619999999999999,45.584000000000003,143.077,143.077,0.29899999999999999]
["Y","Y",1,15,5,40,"YY115540",3251,19,"na","na","na","na","na",1,"na","na","na",3,"na","na","na",2,"na",4,4,1,"na",2,1,1,"na","na","na","na","na","na","na","na","na","na",85.6,"na","na","na",99.7,"na","na","na",82.5,"na",90,90,18.5,"na",53.5,11.5,65.5,"na","na","na","na","na","na","na","na","na","na",21,"na","na","na",247,"na","na","na",-5,"na",-26,-26,-16,"na",0,-25,-29,"na","na","na","na","na","na","na","na","na","na","NA","na","na","na",-1087,"na","na","na","NA","na",-646,-646,"NA","na",-261,"NA",-836,"na","na","na","na","na",4.2610000000000001,19.800999999999998,10.848000000000001,2.9020000000000001,14.125,121.532,10.368,10.368,0.32800000000000001]
["Y","Y",3,15,5,40,"YY315540",3251,19,"na","na","na","na","na",1,"na","na","na",3,"na","na","na",2,"na",4,4,1,"na",2,1,1,"na","na","na","na","na","na","na","na","na","na",85.6,"na","na","na",99.7,"na","na","na",82.5,"na",90,90,18.5,"na",53.5,11.5,65.5,"na","na","na","na","na","na","na","na","na","na",21,"na","na","na",247,"na","na","na",-5,"na",-26,-26,-16,"na",0,-25,-29,"na","na","na","na","na","na","na","na","na","na","NA","na","na","na",-1087,"na","na","na","NA","na",-646,-646,"NA","na",-261,"NA",-836,"na","na","na","na","na",4.2610000000000001,19.800999999999998,10.848000000000001,2.9020000000000001,14.125,121.532,10.368,10.368,0.32800000000000001]
["Y","Y",1,30,5,40,"YY130540",4814.8,27,"na","na","na","na","na",1,"na","na","na",5,"na","na","na",2,"na",6,6,1,"na",2,1,3,"na","na","na","na","na","na","na","na","na","na",93.6,"na","na","na",99.4,"na","na","na",40.700000000000003,"na",89.2,89.2,27.4,"na",89.1,23.7,97.8,"na","na","na","na","na","na","na","na","na","na",42,"na","na","na",-11,"na","na","na",17,"na",-5,-5,-26,"na",17,-15,401,"na","na","na","na","na","na","na","na","na","na","NA","na","na","na",-527,"na","na","na",-8,"na",-428,-428,"NA","na",-1806,"NA",-2396,"na","na","na","na","na",4.2969999999999997,17.710999999999999,14.553000000000001,72.97,3.19,231.85900000000001,7.101,7.101,0.35499999999999998]
["Y","Y",3,30,5,40,"YY330540",4814.8,27,"na","na","na","na","na",1,"na","na","na",5,"na","na","na",2,"na",6,6,1,"na",2,1,3,"na","na","na","na","na","na","na","na","na","na",93.6,"na","na","na",99.4,"na","na","na",40.700000000000003,"na",89.2,89.2,27.4,"na",89.1,23.7,97.8,"na","na","na","na","na","na","na","na","na","na",42,"na","na","na",-11,"na","na","na",17,"na",-5,-5,-26,"na",17,-15,401,"na","na","na","na","na","na","na","na","na","na","NA","na","na","na",-527,"na","na","na",-8,"na",-428,-428,"NA","na",-1806,"NA",-2396,"na","na","na","na","na",4.2969999999999997,17.710999999999999,14.553000000000001,72.97,3.19,231.85900000000001,7.101,7.101,0.35499999999999998]
["Y","Y",1,5,10,40,"YY151040",867.8,9,"na","na","na","na","na",1,"na","na","na",1,"na","na","na",1,"na",1,1,1,"na",1,1,1,"na","na","na","na","na","na","na","na","na","na",33.799999999999997,"na","na","na",100,"na","na","na",27.6,"na",95.7,95.7,5,"na",35.299999999999997,3.8,43,"na","na","na","na","na","na","na","na","na","na",3,"na","na","na",10,"na","na","na",-7,"na",200,200,0,"na",0,-2,-10,"na","na","na","na","na","na","na","na","na","na","NA","na","na","na","NA","na","na","na","NA","na","NA","NA","NA","na",-566,"NA",-1124,"na","na","na","na","na",4.2949999999999999,31.606999999999999,8.8409999999999993,4.0599999999999996,4.1619999999999999,45.584000000000003,143.077,143.077,0.29899999999999999]
["Y","Y",3,5,10,40,"YY351040",867.8,9,"na","na","na","na","na",1,"na","na","na",1,"na","na","na",1,"na",1,1,1,"na",1,1,1,"na","na","na","na","na","na","na","na","na","na",33.799999999999997,"na","na","na",100,"na","na","na",27.6,"na",95.7,95.7,5,"na",35.299999999999997,3.8,43,"na","na","na","na","na","na","na","na","na","na",3,"na","na","na",10,"na","na","na",-7,"na",200,200,0,"na",0,-2,-10,"na","na","na","na","na","na","na","na","na","na","NA","na","na","na","NA","na","na","na","NA","na","NA","NA","NA","na","NA","NA","NA","na","na","na","na","na",4.2949999999999999,31.606999999999999,8.8409999999999993,4.0599999999999996,4.1619999999999999,45.584000000000003,143.077,143.077,0.29899999999999999]
["Y","Y",1,15,10,40,"YY1151040",3246,21,"na","na","na","na","na",1,"na","na","na",4,"na","na","na",2,"na",4,4,1,"na",2,1,2,"na","na","na","na","na","na","na","na","na","na",94.7,"na","na","na",99.5,"na","na","na",53.7,"na",97.4,97.4,20.2,"na",71.099999999999994,15.6,87.1,"na","na","na","na","na","na","na","na","na","na",-38,"na","na","na",-38,"na","na","na",-31,"na",748,748,-39,"na",-10,-28,-41,"na","na","na","na","na","na","na","na","na","na","NA","na","na","na",-299,"na","na","na",-47,"na",-914,-914,"NA","na","NA","NA","NA","na","na","na","na","na",4.2889999999999997,18.408999999999999,14.242000000000001,4.4349999999999996,3.944,209.13499999999999,127.438,127.438,0.33]
["Y","Y",3,15,10,40,"YY3151040",3246,21,"na","na","na","na","na",1,"na","na","na",4,"na","na","na",2,"na",4,4,1,"na",2,1,2,"na","na","na","na","na","na","na","na","na","na",94.7,"na","na","na",99.5,"na","na","na",53.7,"na",97.4,97.4,20.2,"na",71.099999999999994,15.6,87.1,"na","na","na","na","na","na","na","na","na","na",-38,"na","na","na",-38,"na","na","na",-31,"na",748,748,-39,"na",-10,-28,-41,"na","na","na","na","na","na","na","na","na","na","NA","na","na","na",-299,"na","na","na",-47,"na",-914,-914,"NA","na","NA","NA","NA","na","na","na","na","na",4.2889999999999997,18.408999999999999,14.242000000000001,4.4349999999999996,3.944,209.13499999999999,127.438,127.438,0.33]
["Y","Y",1,30,10,40,"YY1301040",7928.2,40,"na","na","na","na","na",1,"na","na","na",8,"na","na","na",4,"na",9,9,1,"na",3,2,3,"na","na","na","na","na","na","na","na","na","na",96.9,"na","na","na",99,"na","na","na",71.7,"na",97.3,97.3,45.3,"na",94.2,14.6,86.8,"na","na","na","na","na","na","na","na","na","na",-8,"na","na","na",12,"na","na","na",-8,"na",455,455,4,"na",-46,-29,-71,"na","na","na","na","na","na","na","na","na","na","NA","na","na","na",-532,"na","na","na",-83,"na",-879,-879,"NA","na",-1947,-42,-763,"na","na","na","na","na",4.2859999999999996,16.678000000000001,8.8309999999999995,3.2309999999999999,4.2960000000000003,403.15699999999998,54.576000000000001,54.576000000000001,0.41199999999999998]
["Y","Y",3,30,10,40,"YY3301040",7928.2,40,"na","na","na","na","na",1,"na","na","na",8,"na","na","na",4,"na",9,9,1,"na",3,2,3,"na","na","na","na","na","na","na","na","na","na",96.9,"na","na","na",99,"na","na","na",71.7,"na",97.3,97.3,45.3,"na",94.2,14.6,86.8,"na","na","na","na","na","na","na","na","na","na",-8,"na","na","na",12,"na","na","na",-8,"na",455,455,4,"na",-46,-29,-71,"na","na","na","na","na","na","na","na","na","na","NA","na","na","na",-532,"na","na","na",-83,"na",-879,-879,"NA","na",-1947,-42,-763,"na","na","na","na","na",4.2859999999999996,16.678000000000001,8.8309999999999995,3.2309999999999999,4.2960000000000003,403.15699999999998,54.576000000000001,54.576000000000001,0.41199999999999998]
["Y","N",1,5,5,20,"YN15520",1102,{"$f":"O30+S30+W30+Y30+AA30+AC30+ AD30+AE30","v":9},"na","na","na","na","na",1,"na","na","na",1,"na","na","na",1,"na",2,"na",1,"na",1,1,1,"na","na","na","na","na","na","na","na","na","na",16.100000000000001,"na","na","na",100,"na","na","na",12.8,"na",60.7,0,6.4,"na",35.799999999999997,3.5,43.2,"na","na","na","na","na","na","na","na","na","na",0,"na","na","na",652,"na","na","na",1,"na",-9,"na",-11,"na",0,-4,13,"na","na","na","na","na","na","na","na","na","na","NA","na","na","na","NA","na","na","na","NA","na",-230,"na","NA","na","NA","NA","NA","na","na","na","na","na",4.2629999999999999,31.04,7.62,4.085,3.54,41.207999999999998,7.5339999999999998,"na",0.313]
["Y","N",3,5,5,20,"YN35520",1102,{"$f":"O31+S31+W31+Y31+AA31+AC31+ AD31+AE31","v":9},"na","na","na","na","na",1,"na","na","na",1,"na","na","na",1,"na",2,"na",1,"na",1,1,1,"na","na","na","na","na","na","na","na","na","na",16.100000000000001,"na","na","na",100,"na","na","na",12.8,"na",60.7,0,6.4,"na",35.799999999999997,3.5,43.2,"na","na","na","na","na","na","na","na","na","na",0,"na","na","na",652,"na","na","na",1,"na",-9,"na",-11,"na",0,-4,13,"na","na","na","na","na","na","na","na","na","na","NA","na","na","na","NA","na","na","na","NA","na",-230,"na","NA","na","NA","NA","NA","na","na","na","na","na",4.2629999999999999,31.04,7.62,4.085,3.54,41.207999999999998,7.5339999999999998,"na",0.313]
["Y","N",1,15,5,20,"YN115520",4968,19,"na","na","na","na","na",1,"na","na","na",5,"na","na","na",2,"na",6,"na",1,"na",2,1,1,"na","na","na","na","na","na","na","na","na","na",64.900000000000006,"na","na","na",99.4,"na","na","na",57.2,"na",91.6,0,28.2,"na",89,16.8,97.8,"na","na","na","na","na","na","na","na","na","na",-4,"na","na","na",13,"na","na","na",14,"na",-11,"na",-17,"na",-18,-1,299,"na","na","na","na","na","na","na","na","na","na","NA","na","na","na",-565,"na","na","na","NA","na",-571,"na","NA","na",-1868,"NA",-2462,"na","na","na","na","na",4.2930000000000001,17.641999999999999,10.124000000000001,75.930000000000007,5.53,60.616999999999997,7.4550000000000001,"na",0.35599999999999998]
["Y","N",3,15,5,20,"YN315520",4968,19,"na","na","na","na","na",1,"na","na","na",5,"na","na","na",2,"na",6,"na",1,"na",2,1,1,"na","na","na","na","na","na","na","na","na","na",64.900000000000006,"na","na","na",99.4,"na","na","na",57.2,"na",91.6,0,28.2,"na",89,16.8,97.8,"na","na","na","na","na","na","na","na","na","na",-4,"na","na","na",13,"na","na","na",14,"na",-11,"na",-17,"na",-18,-1,299,"na","na","na","na","na","na","na","na","na","na","NA","na","na","na",-565,"na","na","na","NA","na",-571,"na","NA","na",-1868,"NA",-2462,"na","na","na","na","na",4.2930000000000001,17.641999999999999,10.124000000000001,75.930000000000007,5.53,60.616999999999997,7.4550000000000001,"na",0.35599999999999998]
["Y","N",1,30,5,20,"YN130520",4968,19,"na","na","na","na","na",1,"na","na","na",5,"na","na","na",2,"na",6,"na",1,"na",2,1,1,"na","na","na","na","na","na","na","na","na","na",64.900000000000006,"na","na","na",99.4,"na","na","na",57.2,"na",91.6,0,28.2,"na",89,16.8,97.8,"na","na","na","na","na","na","na","na","na","na",-4,"na","na","na",13,"na","na","na",14,"na",-11,"na",-17,"na",-18,-1,299,"na","na","na","na","na","na","na","na","na","na","NA","na","na","na",-565,"na","na","na","NA","na",-571,"na","NA","na",-1868,"NA",-2462,"na","na","na","na","na",4.2930000000000001,17.641999999999999,10.124000000000001,75.930000000000007,5.53,60.616999999999997,7.4550000000000001,"na",0.35599999999999998]
["Y","N",3,30,5,20,"YN330520",4968,19,"na","na","na","na","na",1,"na","na","na",5,"na","na","na",2,"na",6,"na",1,"na",2,1,1,"na","na","na","na","na","na","na","na","na","na",64.900000000000006,"na","na","na",99.4,"na","na","na",57.2,"na",91.6,0,28.2,"na",89,16.8,97.8,"na","na","na","na","na","na","na","na","na","na",-4,"na","na","na",13,"na","na","na",14,"na",-11,"na",-17,"na",-18,-1,299,"na","na","na","na","na","na","na","na","na","na","NA","na","na","na",-565,"na","na","na","NA","na",-571,"na","NA","na",-1868,"NA",-2462,"na","na","na","na","na",4.2930000000000001,17.641999999999999,10.124000000000001,75.930000000000007,5.53,60.616999999999997,7.4550000000000001,"na",0.35599999999999998]
["Y","N",1,5,10,20,"YN151020",1102,9,"na","na","na","na","na",1,"na","na","na",1,"na","na","na",1,"na",2,"na",1,"na",1,1,1,"na","na","na","na","na","na","na","na","na","na",16.100000000000001,"na","na","na",100,"na","na","na",12.8,"na",60.7,0,6.4,"na",35.799999999999997,3.5,43.2,"na","na","na","na","na","na","na","na","na","na",0,"na","na","na",652,"na","na","na",1,"na",-9,"na",-11,"na",0,-4,13,"na","na","na","na","na","na","na","na","na","na","NA","na","na","na","NA","na","na","na","NA","na",-230,"na","NA","na","NA","NA","NA","na","na","na","na","na",4.2629999999999999,31.04,7.62,4.085,3.54,41.207999999999998,7.5339999999999998,"na",0.313]
["Y","N",3,5,10,20,"YN351020",1102,9,"na","na","na","na","na",1,"na","na","na",1,"na","na","na",1,"na",2,"na",1,"na",1,1,1,"na","na","na","na","na","na","na","na","na","na",16.100000000000001,"na","na","na",100,"na","na","na",12.8,"na",60.7,0,6.4,"na",35.799999999999997,3.5,43.2,"na","na","na","na","na","na","na","na","na","na",0,"na","na","na",652,"na","na","na",1,"na",-9,"na",-11,"na",0,-4,13,"na","na","na","na","na","na","na","na","na","na","NA","na","na","na","NA","na","na","na","NA","na",-230,"na","NA","na","NA","NA","NA","na","na","na","na","na",4.2629999999999999,31.04,7.62,4.085,3.54,41.207999999999998,7.5339999999999998,"na",0.313]
["Y","N",1,15,10,20,"YN1151020",6163,26,"na","na","na","na","na",1,"na","na","na",6,"na","na","na",5,"na",7,"na",1,"na",4,1,1,"na","na","na","na","na","na","na","na","na","na",79.5,"na","na","na",99.2,"na","na","na",81.599999999999994,"na",97.3,0,35.1,"na",53.2,22,52.2,"na","na","na","na","na","na","na","na","na","na",-12,"na","na","na",19,"na","na","na",-13,"na",424,"na",-54,"na",0,-13,-26,"na","na","na","na","na","na","na","na","na","na","NA","na","na","na",-627,"na","na","na","NA","na",-896,"na","NA","na",0,"NA",-7,"na","na","na","na","na",4.2839999999999998,16.905999999999999,11.715999999999999,2.1030000000000002,13.256,74.44,55.377000000000002,"na",0.374]
["Y","N",3,15,10,20,"YN3151020",6163,26,"na","na","na","na","na",1,"na","na","na",6,"na","na","na",5,"na",7,"na",1,"na",4,1,1,"na","na","na","na","na","na","na","na","na","na",79.5,"na","na","na",99.2,"na","na","na",81.599999999999994,"na",97.3,0,35.1,"na",53.2,22,52.2,"na","na","na","na","na","na","na","na","na","na",-12,"na","na","na",19,"na","na","na",-13,"na",424,"na",-54,"na",0,-13,-26,"na","na","na","na","na","na","na","na","na","na","NA","na","na","na",-627,"na","na","na","NA","na",-896,"na","NA","na",0,"NA",-7,"na","na","na","na","na",4.2839999999999998,16.905999999999999,11.715999999999999,2.1030000000000002,13.256,74.44,55.377000000000002,"na",0.374]
["Y","N",1,30,10,20,"YN1301020",11510,40,"na","na","na","na","na",1,"na","na","na",12,"na","na","na",5,"na",15,"na",1,"na",4,1,1,"na","na","na","na","na","na","na","na","na","na",87.3,"na","na","na",98.5,"na","na","na",98,"na",85.1,0,65.400000000000006,"na",99.3,46.7,97,"na","na","na","na","na","na","na","na","na","na",69,"na","na","na",-54,"na","na","na",688,"na",-61,"na",-1,"na",41,-31,34,"na","na","na","na","na","na","na","na","na","na","NA","na","na","na",-228,"na","na","na","NA","na",-64,"na","NA","na",-2507,"NA",-1901,"na","na","na","na","na",4.2709999999999999,60.454999999999998,22.611999999999998,5.9690000000000003,247.434,161.06200000000001,6.077,"na",0.57599999999999996]
["Y","N",3,30,10,20,"YN3301020",11510,40,"na","na","na","na","na",1,"na","na","na",12,"na","na","na",5,"na",15,"na",1,"na",4,1,1,"na","na","na","na","na","na","na","na","na","na",87.3,"na","na","na",98.5,"na","na","na",98,"na",85.1,0,65.400000000000006,"na",99.3,46.7,97,"na","na","na","na","na","na","na","na","na","na",69,"na","na","na",-54,"na","na","na",688,"na",-61,"na",-1,"na",41,-31,34,"na","na","na","na","na","na","na","na","na","na","NA","na","na","na",-228,"na","na","na","NA","na",-64,"na","NA","na",-2507,"NA",-1901,"na","na","na","na","na",4.2709999999999999,60.454999999999998,22.611999999999998,5.9690000000000003,247.434,161.06200000000001,6.077,"na",0.57599999999999996]
["Y","N",1,5,5,40,"YN15540",1067.8,9,"na","na","na","na","na",1,"na","na","na",1,"na","na","na",1,"na",2,"na",1,"na",1,1,1,"na","na","na","na","na","na","na","na","na","na",31.8,"na","na","na",100,"na","na","na",27.2,"na",59.9,0,6.2,"na",35.5,4.9000000000000004,21.7,"na","na","na","na","na","na","na","na","na","na",-14,"na","na","na",658,"na","na","na",-7,"na",-40,"na",-11,"na",0,-9,6,"na","na","na","na","na","na","na","na","na","na","NA","na","na","na","NA","na","na","na","NA","na",-230,"na","NA","na","NA","NA",-20,"na","na","na","na","na",4.274,31.712,8.8109999999999999,2.2930000000000001,4.2430000000000003,42.198,8.0839999999999996,"na",0.309]
["Y","N",3,5,5,40,"YN35540",1067.8,9,"na","na","na","na","na",1,"na","na","na",1,"na","na","na",1,"na",2,"na",1,"na",1,1,1,"na","na","na","na","na","na","na","na","na","na",31.8,"na","na","na",100,"na","na","na",27.2,"na",59.9,0,6.2,"na",35.5,4.9000000000000004,21.7,"na","na","na","na","na","na","na","na","na","na",-14,"na","na","na",658,"na","na","na",-7,"na",-40,"na",-11,"na",0,-9,6,"na","na","na","na","na","na","na","na","na","na","NA","na","na","na","NA","na","na","na","NA","na",-230,"na","NA","na","NA","NA",-20,"na","na","na","na","na",4.274,31.712,8.8109999999999999,2.2930000000000001,4.2430000000000003,42.198,8.0839999999999996,"na",0.309]
["Y","N",1,15,5,40,"YN115540",4125.3999999999996,18,"na","na","na","na","na",1,"na","na","na",4,"na","na","na",2,"na",5,"na",2,"na",2,1,1,"na","na","na","na","na","na","na","na","na","na",91,"na","na","na",99.5,"na","na","na",96.1,"na",92.1,0,11.5,"na",71.099999999999994,18,86.9,"na","na","na","na","na","na","na","na","na","na",-28,"na","na","na",234,"na","na","na",135,"na",3,"na",-6,"na",-44,-19,-45,"na","na","na","na","na","na","na","na","na","na","NA","na","na","na",-860,"na","na","na","NA","na",-627,"na",-9,"na",-1104,"NA",-1685,"na","na","na","na","na",4.2889999999999997,18.404,12.965999999999999,4.4050000000000002,68.016999999999996,172.90199999999999,11.904999999999999,"na",0.29599999999999999]
["Y","N",3,15,5,40,"YN315540",4125.3999999999996,18,"na","na","na","na","na",1,"na","na","na",4,"na","na","na",2,"na",5,"na",2,"na",2,1,1,"na","na","na","na","na","na","na","na","na","na",91,"na","na","na",99.5,"na","na","na",96.1,"na",92.1,0,11.5,"na",71.099999999999994,18,86.9,"na","na","na","na","na","na","na","na","na","na",-28,"na","na","na",234,"na","na","na",135,"na",3,"na",-6,"na",-44,-19,-45,"na","na","na","na","na","na","na","na","na","na","NA","na","na","na",-860,"na","na","na","NA","na",-627,"na",-9,"na",-1104,"NA",-1685,"na","na","na","na","na",4.2889999999999997,18.404,12.965999999999999,4.4050000000000002,68.016999999999996,172.90199999999999,11.904999999999999,"na",0.29599999999999999]
["Y","N",1,30,5,40,"YN130540",4814.8,21,"na","na","na","na","na",1,"na","na","na",5,"na","na","na",2,"na",6,"na",1,"na",2,1,3,"na","na","na","na","na","na","na","na","na","na",93.6,"na","na","na",99.4,"na","na","na",40.700000000000003,"na",89.2,0,27.4,"na",89.1,23.7,97.8,"na","na","na","na","na","na","na","na","na","na",42,"na","na","na",-11,"na","na","na",17,"na",-5,"na",-26,"na",17,-15,401,"na","na","na","na","na","na","na","na","na","na","NA","na","na","na",-527,"na","na","na",-8,"na",-428,"na","NA","na",-1806,"NA",-2396,"na","na","na","na","na",4.2969999999999997,17.710999999999999,14.553000000000001,72.97,3.19,231.85900000000001,7.101,"na",0.35499999999999998]
["Y","N",3,30,5,40,"YN330540",4814.8,21,"na","na","na","na","na",1,"na","na","na",5,"na","na","na",2,"na",6,"na",1,"na",2,1,3,"na","na","na","na","na","na","na","na","na","na",93.6,"na","na","na",99.4,"na","na","na",40.700000000000003,"na",89.2,0,27.4,"na",89.1,23.7,97.8,"na","na","na","na","na","na","na","na","na","na",42,"na","na","na",-11,"na","na","na",17,"na",-5,"na",-26,"na",17,-15,401,"na","na","na","na","na","na","na","na","na","na","NA","na","na","na",-527,"na","na","na",-8,"na",-428,"na","NA","na",-1806,"NA",-2396,"na","na","na","na","na",4.2969999999999997,17.710999999999999,14.553000000000001,72.97,3.19,231.85900000000001,7.101,"na",0.35499999999999998]
["Y","N",1,5,10,40,"YN151040",1067.8,9,"na","na","na","na","na",1,"na","na","na",1,"na","na","na",1,"na",2,"na",1,"na",1,1,1,"na","na","na","na","na","na","na","na","na","na",30.5,"na","na","na",100,"na","na","na",28.1,"na",59.6,0,6.1,"na",35.299999999999997,5.2,43.1,"na","na","na","na","na","na","na","na","na","na",12,"na","na","na",694,"na","na","na",24,"na",-1,"na",9,"na",0,-15,0,"na","na","na","na","na","na","na","na","na","na","NA","na","na","na","NA","na","na","na","NA","na",-200,"na","NA","na","NA","NA",-1089,"na","na","na","na","na",4.266,31.533999999999999,11.196,4.0979999999999999,4.1639999999999997,40.75,7.6769999999999996,"na",0.30599999999999999]
["Y","N",3,5,10,40,"YN351040",1067.8,9,"na","na","na","na","na",1,"na","na","na",1,"na","na","na",1,"na",2,"na",1,"na",1,1,1,"na","na","na","na","na","na","na","na","na","na",30.5,"na","na","na",100,"na","na","na",28.1,"na",59.6,0,6.1,"na",35.299999999999997,5.2,43.1,"na","na","na","na","na","na","na","na","na","na",12,"na","na","na",694,"na","na","na",24,"na",-1,"na",9,"na",0,-15,0,"na","na","na","na","na","na","na","na","na","na","NA","na","na","na","NA","na","na","na","NA","na",-200,"na","NA","na","NA","NA",-1089,"na","na","na","na","na",4.266,31.533999999999999,11.196,4.0979999999999999,4.1639999999999997,40.75,7.6769999999999996,"na",0.30599999999999999]
["Y","N",1,15,10,40,"YN1151040",5540.6,23,"na","na","na","na","na",1,"na","na","na",6,"na","na","na",3,"na",7,"na",1,"na",3,1,1,"na","na","na","na","na","na","na","na","na","na",81.400000000000006,"na","na","na",99.2,"na","na","na",97.6,"na",87.3,0,31.3,"na",71.400000000000006,21,87.4,"na","na","na","na","na","na","na","na","na","na",4,"na","na","na",426,"na","na","na",603,"na",-69,"na",-107,"na",-16,603,-28,"na","na","na","na","na","na","na","na","na","na","NA","na","na","na",-699,"na","na","na","NA","na",-281,"na","NA","na",-241,"NA","NA","na","na","na","na","na",4.2830000000000004,16.895,9.84,3.66,283.779,100.239,7.6639999999999997,"na",0.36399999999999999]
["Y","N",3,15,10,40,"YN3151040",5540.6,23,"na","na","na","na","na",1,"na","na","na",6,"na","na","na",3,"na",7,"na",1,"na",3,1,1,"na","na","na","na","na","na","na","na","na","na",81.400000000000006,"na","na","na",99.2,"na","na","na",97.6,"na",87.3,0,31.3,"na",71.400000000000006,21,87.4,"na","na","na","na","na","na","na","na","na","na",4,"na","na","na",426,"na","na","na",603,"na",-69,"na",-107,"na",-16,603,-28,"na","na","na","na","na","na","na","na","na","na","NA","na","na","na",-699,"na","na","na","NA","na",-281,"na","NA","na",-241,"NA","NA","na","na","na","na","na",4.2830000000000004,16.895,9.84,3.66,283.779,100.239,7.6639999999999997,"na",0.36399999999999999]
["Y","N",1,30,10,40,"YN1301040",11448.4,41,"na","na","na","na","na",1,"na","na","na",11,"na","na","na",5,"na",15,"na",1,"na",4,1,3,"na","na","na","na","na","na","na","na","na","na",97.4,"na","na","na",98.6,"na","na","na",94.3,"na",84.8,0,64.900000000000006,"na",97.3,42.6,95,"na","na","na","na","na","na","na","na","na","na",98,"na","na","na",-6,"na","na","na",36,"na",-39,"na",-43,"na",-96,-39,-62,"na","na","na","na","na","na","na","na","na","na","NA","na","na","na",-999,"na","na","na",-1255,"na",-69,"na","NA","na",-2583,"NA",-1932,"na","na","na","na","na",4.2859999999999996,16.963000000000001,16.152999999999999,4.6289999999999996,21.193000000000001,525.63499999999999,6.2939999999999996,"na",0.57399999999999995]
["Y","N",3,30,10,40,"YN3301040",11448.4,41,"na","na","na","na","na",1,"na","na","na",11,"na","na","na",5,"na",15,"na",1,"na",4,1,3,"na","na","na","na","na","na","na","na","na","na",97.4,"na","na","na",98.6,"na","na","na",94.3,"na",84.8,0,64.900000000000006,"na",97.3,42.6,95,"na","na","na","na","na","na","na","na","na","na",98,"na","na","na",-6,"na","na","na",36,"na",-39,"na",-43,"na",-96,-39,-62,"na","na","na","na","na","na","na","na","na","na","NA","na","na","na",-999,"na","na","na",-1255,"na",-69,"na","NA","na",-2583,"NA",-1932,"na","na","na","na","na",4.2859999999999996,16.963000000000001,16.152999999999999,4.6289999999999996,21.193000000000001,525.63499999999999,6.2939999999999996,"na",0.57399999999999995]
["N","Y",1,5,5,20,"NY15520",889.96699999999998,8,"na","na","na","na","na",1,"na","na","na",1,"na","na","na",1,"na",1,1,1,"na","na",1,1,"na","na","na","na","na","na","na","na","na","na",15.2,"na","na","na",100,"na","na","na",13.6,"na",98.5,98.5,5.0999999999999996,"na","na",3.6,44.4,"na","na","na","na","na","na","na","na","na","na",-1,"na","na","na",7,"na","na","na",1,"na",0,0,0,"na",0,-1,-6,"na","na","na","na","na","na","na","na","na","na","na","na","na","na","na","na","na","na","na","na","na",0,"na","na","na","na",0,"na","na","na","na","na",4.2789999999999999,"na",8.8140000000000001,2.6389999999999998,3.3479999999999999,38.930999999999997,154.12299999999999,154.12299999999999,0.30099999999999999]
["N","Y",3,5,5,20,"NY35520",889.96699999999998,8,"na","na","na","na","na",1,"na","na","na",1,"na","na","na",1,"na",1,1,1,"na","na",1,1,"na","na","na","na","na","na","na","na","na","na",15.2,"na","na","na",100,"na","na","na",13.6,"na",98.5,98.5,5.0999999999999996,"na","na",3.6,44.4,"na","na","na","na","na","na","na","na","na","na",-1,"na","na","na",7,"na","na","na",1,"na",0,0,0,"na",0,-1,-6,"na","na","na","na","na","na","na","na","na","na","na","na","na","na","na","na","na","na","na","na","na",0,"na","na","na","na",0,"na","na","na","na","na",4.2789999999999999,"na",8.8140000000000001,2.6389999999999998,3.3479999999999999,38.930999999999997,154.12299999999999,154.12299999999999,0.30099999999999999]
["N","Y",1,15,5,20,"NY115520",3371.17,21,"na","na","na","na","na",1,"na","na","na",3,"na","na","na",1,"na",5,5,1,"na","na",2,3,"na","na","na","na","na","na","na","na","na","na",45.7,"na","na","na",99.6,"na","na","na",40.9,"na",74.8,74.8,19.2,"na","na",6.1,44.1,"na","na","na","na","na","na","na","na","na","na",2,"na","na","na",1023,"na","na","na",-3,"na",0,0,-2,"na",0,0,-3,"na","na","na","na","na","na","na","na","na","na","na","na","na","na",-1120,"na","na","na","na","na",-15,-15,"na","na","na",-2,-11,"na","na","na","na","na",4.2709999999999999,"na",9.8130000000000006,2.105,4.7590000000000003,50.411999999999999,6.6369999999999996,6.6369999999999996,0.33500000000000002]
["N","Y",3,15,5,20,"NY315520",3373.43,22,"na","na","na","na","na",1,"na","na","na",3,"na","na","na",1,"na",5,5,1,"na","na",2,3,"na","na","na","na","na","na","na","na","na","na",45.7,"na","na","na",99.6,"na","na","na",40.9,"na",74.8,74.8,19.2,"na","na",6.1,44.1,"na","na","na","na","na","na","na","na","na","na",2,"na","na","na",1023,"na","na","na",-3,"na",0,0,-2,"na",0,0,-3,"na","na","na","na","na","na","na","na","na","na","na","na","na","na",-1120,"na","na","na","na","na",-15,-15,"na","na","na",-2,-11,"na","na","na","na","na",4.2709999999999999,"na",9.8130000000000006,2.105,4.7590000000000003,50.411999999999999,6.6369999999999996,6.6369999999999996,0.33500000000000002]
["N","Y",1,30,5,20,"NY130520",8673.2999999999993,36,"na","na","na","na","na",1,"na","na","na",8,"na","na","na",1,"na",10,10,1,"na","na",1,4,"na","na","na","na","na","na","na","na","na","na",89.5,"na","na","na",98.9,"na","na","na",97.7,"na",96.1,96.1,49.3,"na","na",34.1,87.7,"na","na","na","na","na","na","na","na","na","na",-3,"na","na","na",225,"na","na","na",104,"na",0,0,-14,"na",0,-23,-10,"na","na","na","na","na","na","na","na","na","na","na","na","na","na",-901,"na","na","na","na","na",-675,-675,"na","na","na","na",-1158,"na","na","na","na","na",4.2770000000000001,"na",16.981999999999999,3.1560000000000001,87.522000000000006,159.69300000000001,10.69,10.69,0.43]
["N","Y",3,30,5,20,"NY330520",8673.2999999999993,36,"na","na","na","na","na",1,"na","na","na",8,"na","na","na",1,"na",10,10,1,"na","na",1,4,"na","na","na","na","na","na","na","na","na","na",89.5,"na","na","na",98.9,"na","na","na",97.7,"na",96.1,96.1,49.3,"na","na",34.1,87.7,"na","na","na","na","na","na","na","na","na","na",-3,"na","na","na",225,"na","na","na",104,"na",0,0,-14,"na",0,-23,-10,"na","na","na","na","na","na","na","na","na","na","na","na","na","na",-901,"na","na","na","na","na",-675,-675,"na","na","na","na",-1158,"na","na","na","na","na",4.2770000000000001,"na",16.981999999999999,3.1560000000000001,87.522000000000006,159.69300000000001,10.69,10.69,0.43]
["N","Y",1,5,10,20,"NY151020",889.96699999999998,8,"na","na","na","na","na",1,"na","na","na",1,"na","na","na",1,"na",1,1,1,"na","na",1,1,"na","na","na","na","na","na","na","na","na","na",15.2,"na","na","na",100,"na","na","na",13.6,"na",98.5,0,5.0999999999999996,"na","na",3.6,44.4,"na","na","na","na","na","na","na","na","na","na",-1,"na","na","na",7,"na","na","na",1,"na",0,0,0,"na",0,-1,-6,"na","na","na","na","na","na","na","na","na","na","na","na","na","na","na","na","na","na","na","na","na",0,"na","na","na","na",0,"na","na","na","na","na",4.2789999999999999,"na",8.8140000000000001,2.6389999999999998,3.3479999999999999,38.930999999999997,154.12299999999999,154.12299999999999,0.30099999999999999]
["N","Y",3,5,10,20,"NY351020",889.96699999999998,8,"na","na","na","na","na",1,"na","na","na",1,"na","na","na",1,"na",1,1,1,"na","na",1,1,"na","na","na","na","na","na","na","na","na","na",15.2,"na","na","na",100,"na","na","na",13.6,"na",98.5,0,5.0999999999999996,"na","na",3.6,44.4,"na","na","na","na","na","na","na","na","na","na",-1,"na","na","na",7,"na","na","na",1,"na",0,0,0,"na",0,-1,-6,"na","na","na","na","na","na","na","na","na","na","na","na","na","na","na","na","na","na","na","na","na",0,"na","na","na","na",0,"na","na","na","na","na",4.2789999999999999,"na",8.8140000000000001,2.6389999999999998,3.3479999999999999,38.930999999999997,154.12299999999999,154.12299999999999,0.30099999999999999]
["N","Y",1,15,10,20,"NY1151020",3376.27,21,"na","na","na","na","na",1,"na","na","na",3,"na","na","na",1,"na",5,5,1,"na","na",1,4,"na","na","na","na","na","na","na","na","na","na",45,"na","na","na",99.7,"na","na","na",40.6,"na",75.099999999999994,75.099999999999994,19.2,"na","na",14,33.200000000000003,"na","na","na","na","na","na","na","na","na","na",-10,"na","na","na",1030,"na","na","na",-24,"na",0,0,-12,"na",0,-8,-7,"na","na","na","na","na","na","na","na","na","na","na","na","na","na",-1123,"na","na","na","na","na",-23,-23,"na","na","na","na",-7,"na","na","na","na","na",4.2720000000000002,"na",13.279,2.0310000000000001,4.6429999999999998,50.442999999999998,6.6959999999999997,6.6959999999999997,0.33300000000000002]
["N","Y",3,15,10,20,"NY3151020",3376.27,21,"na","na","na","na","na",1,"na","na","na",3,"na","na","na",1,"na",5,5,1,"na","na",1,4,"na","na","na","na","na","na","na","na","na","na",45,"na","na","na",99.7,"na","na","na",40.6,"na",75.099999999999994,75.099999999999994,19.2,"na","na",14,33.200000000000003,"na","na","na","na","na","na","na","na","na","na",-10,"na","na","na",1030,"na","na","na",-24,"na",0,0,-12,"na",0,-8,-7,"na","na","na","na","na","na","na","na","na","na","na","na","na","na",-1123,"na","na","na","na","na",-23,-23,"na","na","na","na",-7,"na","na","na","na","na",4.2720000000000002,"na",13.279,2.0310000000000001,4.6429999999999998,50.442999999999998,6.6959999999999997,6.6959999999999997,0.33300000000000002]
["N","Y",1,30,10,20,"NY1301020",8697.17,39,"na","na","na","na","na",1,"na","na","na",8,"na","na","na",1,"na",10,10,1,"na","na",1,7,"na","na","na","na","na","na","na","na","na","na",92,"na","na","na",98.9,"na","na","na",97.3,"na",96.4,96.4,49.6,"na","na",37.5,50.2,"na","na","na","na","na","na","na","na","na","na",-20,"na","na","na",208,"na","na","na",112,"na",0,0,-25,"na",0,-34,-40,"na","na","na","na","na","na","na","na","na","na","na","na","na","na",-955,"na","na","na","na","na",-693,-693,"na","na","na","na",-22,"na","na","na","na","na",4.266,"na",21.68,2.0379999999999998,77.739999999999995,175.923,11.837,11.837,0.432]
["N","Y",3,30,10,20,"NY3301020",8715.9,39,"na","na","na","na","na",2,"na","na","na",8,"na","na","na",1,"na",10,10,1,"na","na",3,4,"na","na","na","na","na","na","na","na","na","na",55.5,"na","na","na",98.9,"na","na","na",97.2,"na",96.6,96.6,49.7,"na","na",12.4,87.5,"na","na","na","na","na","na","na","na","na","na",-27,"na","na","na",184,"na","na","na",108,"na",0,0,-19,"na",0,-2,-40,"na","na","na","na","na","na","na","na","na","na",-1790,"na","na","na",-935,"na","na","na","na","na",-706,-706,"na","na","na",-28,-1178,"na","na","na","na","na",4.2640000000000002,"na",10.173,3.129,74.930999999999997,45.112000000000002,11.788,11.788,0.433]
["N","Y",1,5,5,40,"NY15540",889.96699999999998,8,"na","na","na","na","na",1,"na","na","na",1,"na","na","na",1,"na",1,1,1,"na","na",1,1,"na","na","na","na","na","na","na","na","na","na",28.9,"na","na","na",100,"na","na","na",27.6,"na",98.4,0,5.0999999999999996,"na","na",5.5,44.5,"na","na","na","na","na","na","na","na","na","na",1,"na","na","na",6,"na","na","na",1,"na",0,0,0,"na",0,-1,4,"na","na","na","na","na","na","na","na","na","na","na","na","na","na","na","na","na","na","na","na","na",0,"na","na","na","na",0,"na","na","na","na","na",4.2809999999999997,"na",12.397,2.6379999999999999,3.8090000000000002,42.098999999999997,148.41300000000001,148.41300000000001,0.30199999999999999]
["N","Y",3,5,5,40,"NY35540",889.96699999999998,8,"na","na","na","na","na",1,"na","na","na",1,"na","na","na",1,"na",1,1,1,"na","na",1,1,"na","na","na","na","na","na","na","na","na","na",28.9,"na","na","na",100,"na","na","na",27.6,"na",98.4,0,5.0999999999999996,"na","na",5.5,44.5,"na","na","na","na","na","na","na","na","na","na",1,"na","na","na",6,"na","na","na",1,"na",0,0,0,"na",0,-1,4,"na","na","na","na","na","na","na","na","na","na","na","na","na","na","na","na","na","na","na","na","na",0,"na","na","na","na",0,"na","na","na","na","na",4.2809999999999997,"na",12.397,2.6379999999999999,3.8090000000000002,42.098999999999997,148.41300000000001,148.41300000000001,0.30199999999999999]
["N","Y",1,15,5,40,"NY115540",3272.9,21,"na","na","na","na","na",1,"na","na","na",3,"na","na","na",1,"na",5,5,1,"na","na",2,3,"na","na","na","na","na","na","na","na","na","na",85.2,"na","na","na",99.6,"na","na","na",84,"na",72.7,72.7,18.600000000000001,"na","na",6.8,44.2,"na","na","na","na","na","na","na","na","na","na",4,"na","na","na",893,"na","na","na",-9,"na",0,0,-1,"na",0,2,3,"na","na","na","na","na","na","na","na","na","na","na","na","na","na",-1081,"na","na","na","na","na",-14,-14,"na","na","na",-20,-11,"na","na","na","na","na",4.2839999999999998,"na",10.151999999999999,2.121,13.04,136.67400000000001,6.556,6.556,0.33300000000000002]
["N","Y",3,15,5,40,"NY315540",3293.27,21,"na","na","na","na","na",2,"na","na","na",3,"na","na","na",2,"na",4,4,1,"na","na",2,3,"na","na","na","na","na","na","na","na","na","na",48.4,"na","na","na",99.6,"na","na","na",40.799999999999997,"na",91.5,91.5,18.7,"na","na",6.2,44.3,"na","na","na","na","na","na","na","na","na","na",0,"na","na","na",265,"na","na","na",-38,"na",0,0,-23,"na",0,-1,-4,"na","na","na","na","na","na","na","na","na","na",-32,"na","na","na",-1098,"na","na","na",-33,"na",-627,-627,"na","na","na",-20,-16,"na","na","na","na","na",4.26,"na",9.8569999999999993,2.1059999999999999,3.516,42.860999999999997,9.8360000000000003,9.8360000000000003,0.32800000000000001]
["N","Y",1,30,5,40,"NY130540",7998.13,36,"na","na","na","na","na",1,"na","na","na",8,"na","na","na",3,"na",9,9,1,"na","na",1,4,"na","na","na","na","na","na","na","na","na","na",97.8,"na","na","na",98.9,"na","na","na",72.3,"na",98.4,98.4,45.4,"na","na",33,87.6,"na","na","na","na","na","na","na","na","na","na",-19,"na","na","na",31,"na","na","na",6,"na",0,0,6,"na",0,-10,5,"na","na","na","na","na","na","na","na","na","na","na","na","na","na",-569,"na","na","na",-57,"na",-869,-869,"na","na","na","na",-773,"na","na","na","na","na",4.2729999999999997,"na",16.082999999999998,3.1429999999999998,4.25,455.36099999999999,46.436999999999998,46.436999999999998,0.41099999999999998]
["N","Y",3,30,5,40,{"$f":"_xlfn.CONCAT(A71,B71,C71,D71,E71,F71)","v":"NY330540"},7998.13,36,"na","na","na","na","na",1,"na","na","na",8,"na","na","na",3,"na",9,9,1,"na","na",1,4,"na","na","na","na","na","na","na","na","na","na",97.8,"na","na","na",98.9,"na","na","na",72.3,"na",98.4,98.4,45.4,"na","na",33,87.6,"na","na","na","na","na","na","na","na","na","na",-19,"na","na","na",31,"na","na","na",6,"na",0,0,6,"na",0,-10,5,"na","na","na","na","na","na","na","na","na","na","na","na","na","na",-569,"na","na","na",-57,"na",-869,-869,"na","na","na","na",-773,"na","na","na","na","na",4.2729999999999997,"na",16.082999999999998,3.1429999999999998,4.25,455.36099999999999,46.436999999999998,46.436999999999998,0.41099999999999998]
["N","Y",1,5,10,40,"NY151040",889.96699999999998,8,"na","na","na","na","na",1,"na","na","na",1,"na","na","na",1,"na",1,1,1,"na","na",1,1,"na","na","na","na","na","na","na","na","na","na",28.9,"na","na","na",100,"na","na","na",27.6,"na",98.4,0,5.0999999999999996,"na","na",5.5,44.5,"na","na","na","na","na","na","na","na","na","na",1,"na","na","na",6,"na","na","na",1,"na",0,0,0,"na",0,-1,4,"na","na","na","na","na","na","na","na","na","na","na","na","na","na","na","na","na","na","na","na","na",0,"na","na","na","na",0,"na","na","na","na","na",4.2809999999999997,"na",12.397,2.6379999999999999,3.8090000000000002,42.098999999999997,148.41300000000001,148.41300000000001,0.30199999999999999]
["N","Y",3,5,10,40,"NY351040",889.96699999999998,8,"na","na","na","na","na",1,"na","na","na",1,"na","na","na",1,"na",1,1,1,"na","na",1,1,"na","na","na","na","na","na","na","na","na","na",28.9,"na","na","na",100,"na","na","na",27.6,"na",98.4,0,5.0999999999999996,"na","na",5.5,44.5,"na","na","na","na","na","na","na","na","na","na",1,"na","na","na",6,"na","na","na",1,"na",0,0,0,"na",0,-1,4,"na","na","na","na","na","na","na","na","na","na","na","na","na","na","na","na","na","na","na","na","na",0,"na","na","na","na",0,"na","na","na","na","na",4.2809999999999997,"na",12.397,2.6379999999999999,3.8090000000000002,42.098999999999997,148.41300000000001,148.41300000000001,0.30199999999999999]
["N","Y",1,15,10,40,"NY1151040",3276.1,22,"na","na","na","na","na",1,"na","na","na",3,"na","na","na",3,"na",4,4,1,"na","na",1,5,"na","na","na","na","na","na","na","na","na","na",85.5,"na","na","na",99.6,"na","na","na",27.2,"na",91,91,18.7,"na","na",13.1,26.6,"na","na","na","na","na","na","na","na","na","na",1,"na","na","na",281,"na","na","na",-4,"na",0,0,-18,"na",0,0,-2,"na","na","na","na","na","na","na","na","na","na","na","na","na","na",-1076,"na","na","na",-13,"na",-609,-609,"na","na","na","na",-21,"na","na","na","na","na",4.2809999999999997,"na",12.090999999999999,2.02,3.1880000000000002,127.092,9.9350000000000005,9.9350000000000005,0.33]
["N","Y",3,15,10,40,"NY3151040",3276.1,22,"na","na","na","na","na",1,"na","na","na",3,"na","na","na",3,"na",4,4,1,"na","na",1,5,"na","na","na","na","na","na","na","na","na","na",85.5,"na","na","na",99.6,"na","na","na",27.2,"na",91,91,18.7,"na","na",13.1,26.6,"na","na","na","na","na","na","na","na","na","na",1,"na","na","na",281,"na","na","na",-4,"na",0,0,-18,"na",0,0,-2,"na","na","na","na","na","na","na","na","na","na","na","na","na","na",-1076,"na","na","na",-13,"na",-609,-609,"na","na","na","na",-21,"na","na","na","na","na",4.2809999999999997,"na",12.090999999999999,2.02,3.1880000000000002,127.092,9.9350000000000005,9.9350000000000005,0.33]
["N","Y",1,30,10,40,"NY1301040",7998.13,36,"na","na","na","na","na",1,"na","na","na",8,"na","na","na",3,"na",9,9,1,"na","na",1,4,"na","na","na","na","na","na","na","na","na","na",97.8,"na","na","na",98.9,"na","na","na",72.3,"na",98.4,98.4,45.4,"na","na",33,87.6,"na","na","na","na","na","na","na","na","na","na",-19,"na","na","na",31,"na","na","na",6,"na",0,0,6,"na",0,-10,5,"na","na","na","na","na","na","na","na","na","na","na","na","na","na",-569,"na","na","na",-57,"na",-869,-869,"na","na","na","na",-773,"na","na","na","na","na",4.2729999999999997,"na",16.082999999999998,3.1429999999999998,4.25,455.36099999999999,46.436999999999998,46.436999999999998,0.41099999999999998]
["N","Y",3,30,10,40,"NY3301040",7998.13,36,"na","na","na","na","na",1,"na","na","na",8,"na","na","na",3,"na",9,9,1,"na","na",1,4,"na","na","na","na","na","na","na","na","na","na",97.8,"na","na","na",98.9,"na","na","na",72.3,"na",98.4,98.4,45.4,"na","na",33,87.6,"na","na","na","na","na","na","na","na","na","na",-19,"na","na","na",31,"na","na","na",6,"na",0,0,6,"na",0,-10,5,"na","na","na","na","na","na","na","na","na","na","na","na","na","na",-569,"na","na","na",-57,"na",-869,-869,"na","na","na","na",-773,"na","na","na","na","na",4.2729999999999997,"na",16.082999999999998,3.1429999999999998,4.25,455.36099999999999,46.436999999999998,46.436999999999998,0.41099999999999998]
["N","N",1,5,5,20,"NN15520",1121,7,"na","na","na","na","na",1,"na","na","na",1,"na","na","na",1,"na",2,0,1,"na","na",1,1,"na","na","na","na","na","na","na","na","na","na",15.7,"na","na","na",100,"na","na","na",13.8,"na",61.9,0,6.4,"na","na",4.9000000000000004,44.1,"na","na","na","na","na","na","na","na","na","na",4,"na","na","na",656,"na","na","na",0,"na",10,0,1,"na",0,-4,3,"na","na","na","na","na","na","na","na","na","na","na","na","na","na","na","na","na","na","na","na",-231,"na","na","na","na","na",0,"na","na","na","na","na",4.2830000000000004,"na",10.957000000000001,2.6339999999999999,3.4710000000000001,39.040999999999997,6.9729999999999999,"na",0.308]
["N","N",3,5,5,20,"NN35520",1121,7,"na","na","na","na","na",1,"na","na","na",1,"na","na","na",1,"na",2,0,1,"na","na",1,1,"na","na","na","na","na","na","na","na","na","na",15.7,"na","na","na",100,"na","na","na",13.8,"na",61.9,0,6.4,"na","na",4.9000000000000004,44.1,"na","na","na","na","na","na","na","na","na","na",4,"na","na","na",656,"na","na","na",0,"na",10,0,1,"na",0,-4,3,"na","na","na","na","na","na","na","na","na","na","na","na","na","na","na","na","na","na","na","na",-231,"na","na","na","na","na",0,"na","na","na","na","na",4.2830000000000004,"na",10.957000000000001,2.6339999999999999,3.4710000000000001,39.040999999999997,6.9729999999999999,"na",0.308]
["N","N",1,15,5,20,"NN115520",6228.73,20,"na","na","na","na","na",1,"na","na","na",6,"na","na","na",1,"na",7,0,1,"na","na",1,3,"na","na","na","na","na","na","na","na","na","na",83.5,"na","na","na",99.2,"na","na","na",81,"na",98.5,0,35.4,"na","na",25.4,87.5,"na","na","na","na","na","na","na","na","na","na",-9,"na","na","na",10,"na","na","na",-14,"na",443,0,-13,"na",0,-9,1,"na","na","na","na","na","na","na","na","na","na","na","na","na","na",-650,"na","na","na","na","na",-879,"na","na","na","na","na",-1186,"na","na","na","na","na",4.2850000000000001,"na",13.935,3.4889999999999999,13.86,116.941,49.357999999999997,"na",0.372]
["N","N",3,15,5,20,"NN315520",6228.73,20,"na","na","na","na","na",1,"na","na","na",6,"na","na","na",1,"na",7,0,1,"na","na",1,3,"na","na","na","na","na","na","na","na","na","na",83.5,"na","na","na",99.2,"na","na","na",81,"na",98.5,0,35.4,"na","na",25.4,87.5,"na","na","na","na","na","na","na","na","na","na",-9,"na","na","na",10,"na","na","na",-14,"na",443,0,-13,"na",0,-9,1,"na","na","na","na","na","na","na","na","na","na","na","na","na","na",-650,"na","na","na","na","na",-879,"na","na","na","na","na",-1186,"na","na","na","na","na",4.2850000000000001,"na",13.935,3.4889999999999999,13.86,116.941,49.357999999999997,"na",0.372]
["N","N",1,30,5,20,"NN130520",9924.77,32,"na","na","na","na","na",1,"na","na","na",9,"na","na","na",2,"na",13,0,2,"na","na",1,4,"na","na","na","na","na","na","na","na","na","na",95,"na","na","na",98.8,"na","na","na",60.6,"na",84.6,0,28.2,"na","na",37.9,98.1,"na","na","na","na","na","na","na","na","na","na",32,"na","na","na",87,"na","na","na",-14,"na",-25,0,-21,"na",0,-24,48,"na","na","na","na","na","na","na","na","na","na","na","na","na","na",-1031,"na","na","na",-349,"na",-3217,"na",-31,"na","na","na",-2376,"na","na","na","na","na",4.2729999999999997,"na",21.238,9.077,4.2560000000000002,247.523,6.0410000000000004,"na",0.313]
["N","N",3,30,5,20,"NN330520",10088.6,38,"na","na","na","na","na",3,"na","na","na",10,"na","na","na",3,"na",14,0,3,"na","na",1,4,"na","na","na","na","na","na","na","na","na","na",50.3,"na","na","na",98.7,"na","na","na",41.3,"na",79.8,0,19.100000000000001,"na","na",46.5,99.1,"na","na","na","na","na","na","na","na","na","na",-2,"na","na","na",0,"na","na","na",-17,"na",-6,0,-12,"na",0,-13,1031,"na","na","na","na","na","na","na","na","na","na",-5,"na","na","na",-113,"na","na","na",-8,"na",-14,"na",-20,"na","na","na",-2500,"na","na","na","na","na",4.2779999999999996,"na",27.468,66.710999999999999,3.2490000000000001,40.887999999999998,5.891,"na",0.30099999999999999]
["N","N",1,5,10,20,"NN151020",1121,7,"na","na","na","na","na",1,"na","na","na",1,"na","na","na",1,"na",2,0,1,"na","na",1,1,"na","na","na","na","na","na","na","na","na","na",15.7,"na","na","na",100,"na","na","na",13.8,"na",61.9,0,6.4,"na","na",4.9000000000000004,44.1,"na","na","na","na","na","na","na","na","na","na",4,"na","na","na",656,"na","na","na",0,"na",10,0,1,"na",0,-4,3,"na","na","na","na","na","na","na","na","na","na","na","na","na","na","na","na","na","na","na","na",-231,"na","na","na","na","na",0,"na","na","na","na","na",4.2830000000000004,"na",10.957000000000001,2.6339999999999999,3.4710000000000001,39.040999999999997,6.9729999999999999,"na",0.308]
["N","N",3,5,10,20,"NN351020",1121,7,"na","na","na","na","na",1,"na","na","na",1,"na","na","na",1,"na",2,0,1,"na","na",1,1,"na","na","na","na","na","na","na","na","na","na",15.7,"na","na","na",100,"na","na","na",13.8,"na",61.9,0,6.4,"na","na",4.9000000000000004,44.1,"na","na","na","na","na","na","na","na","na","na",4,"na","na","na",656,"na","na","na",0,"na",10,0,1,"na",0,-4,3,"na","na","na","na","na","na","na","na","na","na","na","na","na","na","na","na","na","na","na","na",-231,"na","na","na","na","na",0,"na","na","na","na","na",4.2830000000000004,"na",10.957000000000001,2.6339999999999999,3.4710000000000001,39.040999999999997,6.9729999999999999,"na",0.308]
["N","N",1,15,10,20,"NN1151020",6228.73,20,"na","na","na","na","na",1,"na","na","na",6,"na","na","na",1,"na",7,0,1,"na","na",1,3,"na","na","na","na","na","na","na","na","na","na",83.5,"na","na","na",99.2,"na","na","na",81,"na",98.5,0,35.4,"na","na",25.4,87.5,"na","na","na","na","na","na","na","na","na","na",-9,"na","na","na",10,"na","na","na",-14,"na",443,0,-13,"na",0,-9,1,"na","na","na","na","na","na","na","na","na","na","na","na","na","na",-650,"na","na","na","na","na",-879,"na","na","na","na","na",-1186,"na","na","na","na","na",4.2850000000000001,"na",13.935,3.4889999999999999,13.86,116.941,49.357999999999997,"na",0.372]
["N","N",3,15,10,20,"NN3151020",6228.73,20,"na","na","na","na","na",1,"na","na","na",6,"na","na","na",1,"na",7,0,1,"na","na",1,3,"na","na","na","na","na","na","na","na","na","na",83.5,"na","na","na",99.2,"na","na","na",81,"na",98.5,0,35.4,"na","na",25.4,87.5,"na","na","na","na","na","na","na","na","na","na",-9,"na","na","na",10,"na","na","na",-14,"na",443,0,-13,"na",0,-9,1,"na","na","na","na","na","na","na","na","na","na","na","na","na","na",-650,"na","na","na","na","na",-879,"na","na","na","na","na",-1186,"na","na","na","na","na",4.2850000000000001,"na",13.935,3.4889999999999999,13.86,116.941,49.357999999999997,"na",0.372]
["N","N",1,30,10,20,"NN1301020",13173.4,39,"na","na","na","na","na",1,"na","na","na",13,"na","na","na",1,"na",15,0,1,"na","na",1,7,"na","na","na","na","na","na","na","na","na","na",92.6,"na","na","na",98.4,"na","na","na",98.9,"na",97.3,0,74.8,"na","na",58.3,81.099999999999994,"na","na","na","na","na","na","na","na","na","na",14,"na","na","na",152,"na","na","na",182,"na",-719,0,-32,"na",0,-28,-5,"na","na","na","na","na","na","na","na","na","na","na","na","na","na",-834,"na","na","na","na","na",-719,"na","na","na","na","na",-26,"na","na","na","na","na",4.2770000000000001,"na",31.47,2.37,308.59500000000003,186.17099999999999,11.819000000000001,"na",0.64800000000000002]
["N","N",3,30,10,20,"NN3301020",13225.8,41,"na","na","na","na","na",3,"na","na","na",12,"na","na","na",2,"na",15,0,1,"na","na",1,7,"na","na","na","na","na","na","na","na","na","na",60.4,"na","na","na",98.5,"na","na","na",80.8,"na",97.8,0,75.2,"na","na",48.7,74.8,"na","na","na","na","na","na","na","na","na","na",-2,"na","na","na",106,"na","na","na",-1,"na",-778,0,4,"na",0,-7,-31,"na","na","na","na","na","na","na","na","na","na",-15,"na","na","na",-1000,"na","na","na",-824,"na",-778,"na","na","na","na","na",-29,"na","na","na","na","na",4.2779999999999996,"na",23.542000000000002,2.2240000000000002,7.351,41.51,13.042999999999999,"na",0.64700000000000002]
["N","N",1,5,5,40,"NN15540",1100,8,"na","na","na","na","na",1,"na","na","na",1,"na","na","na",1,"na",2,0,1,"na","na",1,1,"na","na","na","na","na","na","na","na","na","na",30.8,"na","na","na",100,"na","na","na",27.4,"na",61,0,6.2,"na","na",4.0999999999999996,44.3,"na","na","na","na","na","na","na","na","na","na",-2,"na","na","na",677,"na","na","na",-1,"na",-4,0,0,"na",0,0,1,"na","na","na","na","na","na","na","na","na","na","na","na","na","na","na","na","na","na","na","na",-212,"na","na","na","na","na",0,"na","na","na","na","na",4.3079999999999998,"na",8.8179999999999996,2.6560000000000001,3.7749999999999999,43.75,7.06,"na",0.30599999999999999]
["N","N",3,5,5,40,"NN35540",1100,8,"na","na","na","na","na",1,"na","na","na",1,"na","na","na",1,"na",2,0,1,"na","na",1,1,"na","na","na","na","na","na","na","na","na","na",30.8,"na","na","na",100,"na","na","na",27.4,"na",61,0,6.2,"na","na",4.0999999999999996,44.3,"na","na","na","na","na","na","na","na","na","na",-2,"na","na","na",677,"na","na","na",-1,"na",-4,0,0,"na",0,0,1,"na","na","na","na","na","na","na","na","na","na","na","na","na","na","na","na","na","na","na","na",-212,"na","na","na","na","na",0,"na","na","na","na","na",4.3079999999999998,"na",8.8179999999999996,2.6560000000000001,3.7749999999999999,43.75,7.06,"na",0.30599999999999999]
["N","N",1,15,5,40,"NN115540",5387.2,21,"na","na","na","na","na",1,"na","na","na",5,"na","na","na",2,"na",7,0,1,"na","na",1,4,"na","na","na","na","na","na","na","na","na","na",96.1,"na","na","na",99.4,"na","na","na",67.7,"na",85.3,0,30.7,"na","na",22.3,55,"na","na","na","na","na","na","na","na","na","na",50,"na","na","na",813,"na","na","na",4,"na",-11,0,-25,"na",0,-1,-3,"na","na","na","na","na","na","na","na","na","na","na","na","na","na",-1026,"na","na","na",-498,"na",-114,"na","na","na","na","na",-16,"na","na","na","na","na",4.2779999999999996,"na",13.077999999999999,2.133,4.6870000000000003,283.57600000000002,7.1710000000000003,"na",0.36399999999999999]
["N","N",3,15,5,40,"NN315540",5474.13,21,"na","na","na","na","na",2,"na","na","na",5,"na","na","na",2,"na",7,0,1,"na","na",1,3,"na","na","na","na","na","na","na","na","na","na",77.099999999999994,"na","na","na",99.4,"na","na","na",68.2,"na",86.7,0,31.1,"na","na",22.3,73.5,"na","na","na","na","na","na","na","na","na","na",-2,"na","na","na",727,"na","na","na",-11,"na",-16,0,-26,"na",0,-14,-37,"na","na","na","na","na","na","na","na","na","na",-103,"na","na","na",-1105,"na","na","na",-578,"na",-166,"na","na","na","na","na",-563,"na","na","na","na","na",4.2709999999999999,"na",14.34,2.6110000000000002,4.8659999999999997,61.595999999999997,7.2380000000000004,"na",0.36499999999999999]
["N","N",1,30,5,40,"NN130540",9513.8700000000008,31,"na","na","na","na","na",1,"na","na","na",9,"na","na","na",3,"na",12,0,1,"na","na",1,4,"na","na","na","na","na","na","na","na","na","na",98,"na","na","na",98.8,"na","na","na",81.099999999999994,"na",87.9,0,54.1,"na","na",38.799999999999997,98,"na","na","na","na","na","na","na","na","na","na",73,"na","na","na",98,"na","na","na",-5,"na",-10,0,-13,"na",0,-53,8,"na","na","na","na","na","na","na","na","na","na","na","na","na","na",-1019,"na","na","na",-587,"na",-52,"na","na","na","na","na",-2265,"na","na","na","na","na",4.2869999999999999,"na",18.693999999999999,8.24,5.1440000000000001,448.54199999999997,6.3810000000000002,"na",0.47]
["N","N",3,30,5,40,"NN330540",9710.41,35,"na","na","na","na","na",3,"na","na","na",9,"na","na","na",4,"na",12,0,2,"na","na",1,4,"na","na","na","na","na","na","na","na","na","na",89.4,"na","na","na",98.8,"na","na","na",60.7,"na",89.5,0,27.5,"na","na",39.299999999999997,97.9,"na","na","na","na","na","na","na","na","na","na",9,"na","na","na",129,"na","na","na",0,"na",28,0,-9,"na",0,-2,36,"na","na","na","na","na","na","na","na","na","na",-106,"na","na","na",-998,"na","na","na",-679,"na",-64,"na",13,"na","na","na",-2323,"na","na","na","na","na",4.2779999999999996,"na",20.722999999999999,8.1549999999999994,3.3969999999999998,83.828999999999994,6.4219999999999997,"na",0.312]
["N","N",1,5,10,40,"NN151040",1100,7,"na","na","na","na","na",1,"na","na","na",1,"na","na","na",1,"na",2,0,1,"na","na",1,1,"na","na","na","na","na","na","na","na","na","na",30.8,"na","na","na",100,"na","na","na",27.4,"na",61,0,6.2,"na","na",4.0999999999999996,44.3,"na","na","na","na","na","na","na","na","na","na",-2,"na","na","na",677,"na","na","na",-1,"na",-4,0,0,"na",0,0,1,"na","na","na","na","na","na","na","na","na","na","na","na","na","na","na","na","na","na","na","na",-212,"na","na","na","na","na",0,"na","na","na","na","na",4.3079999999999998,"na",8.8179999999999996,2.6560000000000001,3.7749999999999999,43.75,7.06,"na",0.30599999999999999]
["N","N",3,5,10,40,"NN351040",1100,7,"na","na","na","na","na",1,"na","na","na",1,"na","na","na",1,"na",2,0,1,"na","na",1,1,"na","na","na","na","na","na","na","na","na","na",30.8,"na","na","na",100,"na","na","na",27.4,"na",61,0,6.2,"na","na",4.0999999999999996,44.3,"na","na","na","na","na","na","na","na","na","na",-2,"na","na","na",677,"na","na","na",-1,"na",-4,0,0,"na",0,0,1,"na","na","na","na","na","na","na","na","na","na","na","na","na","na","na","na","na","na","na","na",-212,"na","na","na","na","na",0,"na","na","na","na","na",4.3079999999999998,"na",8.8179999999999996,2.6560000000000001,3.7749999999999999,43.75,7.06,"na",0.30599999999999999]
["N","N",1,15,10,40,"NN1151040",5387.2,21,"na","na","na","na","na",1,"na","na","na",5,"na","na","na",2,"na",7,0,1,"na","na",1,4,"na","na","na","na","na","na","na","na","na","na",96.1,"na","na","na",99.4,"na","na","na",67.7,"na",85.3,0,30.7,"na","na",22.3,55,"na","na","na","na","na","na","na","na","na","na",50,"na","na","na",813,"na","na","na",4,"na",-11,0,-25,"na",0,-1,-3,"na","na","na","na","na","na","na","na","na","na","na","na","na","na",-1026,"na","na","na",-498,"na",-114,"na","na","na","na","na",-16,"na","na","na","na","na",4.2779999999999996,"na",13.077999999999999,2.133,4.6870000000000003,283.57600000000002,7.1710000000000003,"na",0.36399999999999999]
["N","N",3,15,10,40,"NN3151040",5474.13,21,"na","na","na","na","na",2,"na","na","na",5,"na","na","na",2,"na",7,0,1,"na","na",1,3,"na","na","na","na","na","na","na","na","na","na",77.099999999999994,"na","na","na",99.4,"na","na","na",68.2,"na",86.7,0,31.1,"na","na",22.3,73.5,"na","na","na","na","na","na","na","na","na","na",-2,"na","na","na",727,"na","na","na",-11,"na",-16,0,-26,"na",0,-14,-37,"na","na","na","na","na","na","na","na","na","na",-103,"na","na","na",-1105,"na","na","na",-578,"na",-166,"na","na","na","na","na",-563,"na","na","na","na","na",4.2709999999999999,"na",14.34,2.6110000000000002,4.8659999999999997,61.595999999999997,7.2380000000000004,"na",0.36499999999999999]
["N","N",1,30,10,40,"NN1301040",12203.2,40,"na","na","na","na","na",1,"na","na","na",12,"na","na","na",3,"na",14,0,1,"na","na",3,6,"na","na","na","na","na","na","na","na","na","na",98.3,"na","na","na",98.5,"na","na","na",98.4,"na",96.8,0,69.2,"na","na",18,87.3,"na","na","na","na","na","na","na","na","na","na",63,"na","na","na",218,"na","na","na",177,"na",-65,0,-3,"na",0,-29,-11,"na","na","na","na","na","na","na","na","na","na","na","na","na","na",-677,"na","na","na",-1228,"na",-656,"na","na","na","na",-8,-384,"na","na","na","na","na",4.2809999999999997,"na",10.398,2.7090000000000001,69.085999999999999,507.44499999999999,11.840999999999999,"na",0.57499999999999996]
["N","N",3,30,10,40,"NN3301040",12347.3,41,"na","na","na","na","na",3,"na","na","na",12,"na","na","na",3,"na",14,0,1,"na","na",2,6,"na","na","na","na","na","na","na","na","na","na",95,"na","na","na",98.5,"na","na","na",98.4,"na",97.8,0,70,"na","na",25.9,87.3,"na","na","na","na","na","na","na","na","na","na",-6,"na","na","na",91,"na","na","na",71,"na",102,0,-34,"na",0,0,-26,"na","na","na","na","na","na","na","na","na","na",-53,"na","na","na",-577,"na","na","na",-1230,"na",-789,"na","na","na","na",-30,-353,"na","na","na","na","na",4.28,"na",11.084,2.7290000000000001,69.194999999999993,141.12200000000001,16.323,"na",0.57999999999999996]