HIS_GENERAL,CHR_HYPEV,CHR_HYPDIF,CHR_HYP12M,CHR_HYPMED,CHR_CHLEV,CHR_CHDEV,CHR_ASEV,CHR_CANEV,DIB_PREDIB,DIB_GESDIB,DIB_DIBEV,BMI_PREGNOW,BMICAT,SOC_ERRANDS,SOC_PARACTIV,SOC_SCWRKLIM,PAY_PAYWORRY,CVL_HEARDEV,CVL_REAL,CVL_REAL_O,CVL_SERIOUS,CVL_SERIOUS_O,CVL_DEPRESS,CVL_DEPRESS_O,CVL_NORMPAIN,CVL_NORMPAIN_O,CVL_EMPLOYER,CVL_EMPLOYER_O,CVL_MEDIA,CVL_MEDIA_O,CVL_PASSED,CVL_PASSED_O,CVL_COVIDEV,CVL_SYMPT3M,CVL_LONGCVEV,LONGCOVID,CVL_LONGOTH,CVL_LEARNMOR,ACC_DNCEXAM,ACC_DNCDELAY,ACC_DNCCOST,ACC_HTHLAST,ACC_HTHUSUAL,ACC_HTHTYPE,ACC_HOSP12M,ACC_EYE12M,ACC_THER12M,INT_ACCESS,INT_HOMEACC,INT_USEMED,INT_USEDOC,INT_USETEST,PRV_BPCHECK,PRV_CHLCHECK,PRV_DIBCHECK,CAN_MAMMEV,CAN_RECENTM,CAN_BDENSITY,CAN_BDENSINF_C1,CAN_BDENSINF_C2,CAN_BDENSINF_C3,CAN_BDENSINF_C4,CAN_DENSE,OVA_TUBETIED,OVA_TUBECUT,OVA_TUBEREM,OVA_OVARIES,GEN_INTRO,GEN_HLTHINS,GEN_LIFEINS,GEN_DISAINS,GEN_JOB,GEN_TESTEV,CRI_ALCOHOL,SUN_USEFACE,SUN_USESKIN,SUN_AFFORD,SUN_INGRED,SUN_SPRAY,SUN_FEEL,SUN_NOHARM,SUN_REAPPLY,SUN_SAFETY,SUN_CLOUDY,MTL_ANXIETY,MTL_ANXMEDS,MTL_ANXLVL,MTL_DEPRESS,MTL_DEPMEDS,MTL_DEPLVL,CIG_SMKEV,CIG_SMKNOW,CAR_USE,CAR_FREQUSE,CAR_STOPUSE,VEN_USE,VEN_ACDUST,VEN_ACSMOKE,VEN_ACVIRUS,VEN_ACOTHER,VEN_HEPAUSE,VEN_HPNOHEAR,VEN_HPNONEED,VEN_HPNOCOST,VEN_HPNOLOUD,VEN_HPNOFIND,VEN_HPNOOTH,VEN_ACNONEED,VEN_ACNOCOST,VEN_ACNOLOUD,VEN_ACNOOTH,IPV_PUSH,IPV_HIT,IPV_KICK,IPV_HAIR,IPV_SLAM,IPV_CHOKE,IPV_KNIFE,IPV_GUN,IPV_ANY,IPV_SEV,MAR_MARITAL,MAR_EVMARRY,MAR_LEGAL,MAR_WIDIVSEP,MARITAL,MARSTAT,LEGMSTAT,EMP_EMPLOY,EMP_ABSENTWK,EMP_WHYNOWRK,EMPWRKLSWK,CIV_VOL12M,CIV_VOLOTH,CIV_MEET,CIV_VOTELOCL,CIVIC_ENGAGE,LAN_OTHERLAN,LAN_MEDIA,LAN_DOCTOR,LAN_SOCIAL,TEL_NONCELL,TEL_CELL,TEL_HHCELL,START_DATE_R,END_DATE_R,ID_R,P_OUTCOME,SOURCE,QUEX_LANG,P_GENDER,P_GENDERID,P_ORIENT,P_EDUC_R,P_EDUC_R_IFLG,P_RACE_R,P_HHSIZE_R,P_AGEC_R,P_INCOME_R,P_INCOME_R_IFLG,P_POVERTY,P_EMPLOY,P_MARITAL,P_REGION,P_HOMEOWN,P_HOMEOWN_IFLG,P_METRO_R,P_METRO_R_IFLG,P_CITIZEN,P_VETERAN,P_INSUR,P_USBORN,P_VISIT,P_ONEVISIT,P_REMIND,P_CATIATT,P_MODE,P_DEVICE,P_STRATA,P_PSU,P1_CALWT_M1,P2_CALWT_M1,WEIGHT_M1
1,0,-8,-8,-8,0,0,1,0,0,-8,0,-8,3,1,1,0,3,0,-8,-8,-8,-8,-8,-8,-8,-8,-8,-8,-8,-8,-8,-8,0,-8,-8,3,-8,2,2,0,0,3,3,2,0,0,0,1,1,1,1,1,2,0,0,-8,-8,-8,-8,-8,-8,-8,-8,-8,-8,-8,-8,0,-8,-8,-8,-8,-8,3,0,0,2,3,3,3,3,3,3,3,0,0,-8,-6,0,1,1,3,0,-8,-8,2,1,1,1,0,0,0,0,0,0,0,0,-8,-8,-8,-8,0,0,0,0,0,0,0,1,1,1,3,1,-8,3,2,4,1,0,0,4,0,0,0,0,0,2,0,-8,-8,-8,1,1,-8,AUG23,AUG23,100178,3,1,1,1,1,2,1,,2,6,31,5,,2,1,1,2,1,,1,0,1,0,,,2,0,0,,1,2,24,1,163977.26529,,44431.661517
2,0,-8,-8,-8,0,-6,0,0,0,0,0,-8,3,1,1,0,2,1,4,5,4,4,4,2,1,1,3,3,2,7,1,6,0,-8,-8,3,1,1,6,1,1,6,1,2,0,1,0,1,1,1,1,0,4,5,6,0,-8,-8,-8,-8,-8,-8,-8,0,1,0,0,0,-8,-8,-8,-8,-8,2,3,2,1,3,0,3,1,2,2,2,2,0,2,3,0,2,0,-8,0,-8,-8,0,-8,-8,-8,-8,-8,-8,-8,-8,-8,-8,-8,1,1,0,0,0,1,0,0,0,0,0,0,1,1,1,-8,-8,-8,1,1,3,0,0,2,0,0,0,0,1,1,0,-8,-8,-8,0,1,-8,AUG23,AUG23,101746,3,1,1,2,2,2,2,,1,2,62,9,,5,4,1,1,1,,1,0,,0,,,1,1,0,,1,2,12,2,41073.592249,,11129.396169
3,0,-8,-8,-8,0,0,0,0,0,0,0,0,4,2,1,0,1,0,-8,-8,-8,-8,-8,-8,-8,-8,-8,-8,-8,-8,-8,-8,0,-8,-8,3,-8,1,1,0,0,4,2,-8,0,0,0,1,1,0,0,0,1,0,3,0,-8,-8,-8,-8,-8,-8,-8,1,0,0,0,1,0,0,0,0,0,3,2,2,1,1,1,2,3,3,2,2,3,0,1,3,0,1,0,-8,0,-8,-8,0,-8,-8,-8,-8,-8,-8,-8,-8,-8,-8,-8,1,1,1,0,0,0,0,0,0,0,0,0,0,0,2,1,3,-8,2,6,2,0,-6,-8,-8,0,0,0,0,2,0,-8,-8,-8,0,1,-8,AUG23,AUG23,103824,3,1,1,2,2,2,2,,1,6,44,1,,1,1,2,4,2,,2,0,,0,1,1,2,0,0,,1,2,7,2,29606.036708,,8022.1206244
1,0,-8,-8,-8,0,0,0,0,0,-8,0,-8,2,1,1,0,3,0,-8,-8,-8,-8,-8,-8,-8,-8,-8,-8,-8,-8,-8,-8,1,0,-8,-8,-8,3,1,0,0,1,1,1,0,0,0,1,1,1,0,0,1,0,0,-8,-8,-8,-8,-8,-8,-8,-8,-8,-8,-8,-8,0,-8,-8,-8,-8,-8,2,3,2,1,1,2,1,1,4,2,2,4,0,1,0,0,-8,0,-8,0,-8,-8,1,1,0,0,0,0,1,0,0,0,0,0,-8,-8,-8,-8,0,0,0,0,0,0,0,0,0,0,3,0,-8,-8,2,5,4,1,-8,-8,1,0,0,0,1,1,0,-8,-8,-8,1,0,1,AUG23,AUG23,100666,3,1,1,1,,,1,,,5,20,16,,9,1,4,2,1,,2,0,,,,,1,1,4,,1,2,47,1,253086.45512,,68576.895025
3,1,1,1,1,1,1,0,0,0,-8,1,-8,3,1,1,0,3,1,4,2,3,6,1,1,2,4,3,5,2,3,1,7,1,0,0,2,0,1,6,0,0,1,2,-8,1,1,0,1,1,1,0,0,1,1,-8,-8,-8,-8,-8,-8,-8,-8,-8,-8,-8,-8,-8,0,-8,-8,-8,-8,-8,2,0,0,0,2,0,1,2,3,2,3,4,0,3,4,0,1,0,-8,0,-8,-8,0,-8,-8,-8,-8,-8,-8,-8,-8,-8,-8,-8,1,0,0,0,0,0,0,0,0,0,0,0,0,0,1,-8,-8,-8,1,1,3,0,0,2,0,0,0,1,1,1,0,-8,-8,-8,1,1,-8,AUG23,AUG23,101460,3,1,1,1,1,2,1,,1,3,64,11,,6,3,1,1,1,,1,0,1,0,,1,1,1,0,,1,1,110,1343,115644.33862,,31335.259195
3,1,1,1,1,0,0,0,1,0,-8,0,-8,4,2,3,0,1,1,4,4,4,7,1,6,1,3,4,2,1,1,-9,5,1,1,1,1,0,3,1,1,1,1,1,2,0,1,0,1,1,1,1,1,1,1,1,-8,-8,-8,-8,-8,-8,-8,-8,-8,-8,-8,-8,1,0,0,0,0,1,3,3,4,3,2,3,3,1,4,3,1,2,1,2,3,1,3,1,3,0,-8,-8,3,1,0,0,0,1,-8,-8,-8,-8,-8,-8,-8,-8,-8,-8,0,0,0,0,0,0,0,0,0,0,3,0,-8,-8,2,5,4,1,-8,-8,1,0,0,0,0,2,0,-8,-8,-8,0,1,-8,AUG23,AUG23,100571,3,1,1,1,1,4,3,,1,1,27,7,,5,1,4,3,2,,1,0,1,0,1,1,2,0,3,,1,2,12,1,34586.454921,,9371.6263372
4,0,-8,-8,-8,1,0,0,0,0,0,0,0,4,1,1,0,2,0,-8,-8,-8,-8,-8,-8,-8,-8,-8,-8,-8,-8,-8,-8,0,-8,-8,3,-8,6,3,1,1,1,1,1,0,0,0,1,1,0,1,1,1,1,0,1,1,1,0,1,0,0,1,0,1,0,0,0,-8,-8,-8,-8,-8,2,4,3,0,0,0,0,4,4,4,4,0,0,-8,0,0,-8,1,1,0,-8,-8,0,-8,-8,-8,-8,-8,-8,-8,-8,-8,-8,-8,1,1,1,1,0,0,0,0,0,0,0,0,0,0,1,-8,-8,-8,1,1,3,0,0,7,0,0,0,0,0,2,0,-8,-8,-8,0,1,-8,AUG23,AUG23,104887,3,1,1,2,2,2,2,,1,4,42,11,,5,1,1,2,1,,1,0,,0,,,2,0,4,,1,2,24,2,27825.298479,,7539.6076487
2,0,-8,-8,-8,0,0,0,0,1,0,0,-8,9,1,1,0,3,0,-8,-8,-8,-8,-8,-8,-8,-8,-8,-8,-8,-8,-8,-8,0,-8,-8,3,-8,3,1,0,0,1,1,1,0,1,0,1,1,1,1,1,1,1,1,1,1,1,1,0,0,0,1,0,0,0,0,1,0,0,0,0,0,-9,1,1,0,3,0,3,1,-9,3,4,4,0,2,0,0,-8,0,-8,0,-8,-8,2,1,0,-9,0,-9,-8,-8,-8,-8,-8,-8,-8,-8,-8,-8,0,0,0,0,0,0,0,0,0,0,1,-8,-8,-8,1,1,3,0,1,-8,1,1,-8,0,1,1,0,-8,-8,-8,1,1,-8,AUG23,AUG23,103407,3,1,1,2,2,2,3,,2,3,54,11,,6,1,1,3,1,,1,0,1,0,,1,1,1,3,3,2,5,21,1,142906.66811,,38722.323455
3,1,1,1,1,1,0,0,1,0,-8,0,-8,4,2,2,1,1,1,4,5,4,4,-9,3,1,1,3,7,1,6,2,2,0,-8,-8,3,0,3,5,1,0,1,1,1,0,0,0,1,1,1,0,1,1,1,1,-8,-8,-8,-8,-8,-8,-8,-8,-8,-8,-8,-8,1,0,3,3,3,0,3,2,2,3,3,0,1,1,2,4,1,2,0,1,2,0,1,0,-8,0,-8,-8,2,1,0,0,-6,-9,-8,-8,-8,-8,-8,-8,-8,-8,-8,-8,0,0,0,0,0,0,0,0,0,0,3,1,-8,2,2,3,2,0,0,2,0,0,0,0,0,2,0,-8,-8,-8,1,1,-8,AUG23,AUG23,100431,3,1,1,1,1,2,1,,1,2,65,5,,3,3,2,1,1,,1,0,1,0,1,1,1,1,0,,1,1,46,2,110489.69935,,29938.546138
2,0,-8,-8,-8,0,0,0,0,0,0,0,0,2,1,1,0,3,1,3,2,2,3,2,7,4,1,1,4,1,6,3,5,0,-8,-8,3,0,1,1,0,0,2,1,0,0,1,0,1,1,1,0,0,2,3,3,-8,-8,-8,-8,-8,-8,-8,-8,0,0,0,0,0,-8,-8,-8,-8,-8,3,1,1,2,0,1,-6,3,3,2,3,3,1,2,2,1,3,0,-8,0,-8,-8,2,0,0,1,0,0,0,0,1,0,0,1,-8,-8,-8,-8,0,0,0,0,0,0,0,0,0,0,2,0,-8,-8,2,6,4,0,1,-8,1,0,1,0,1,1,0,-8,-8,-8,1,0,0,AUG23,AUG23,107051,3,1,1,2,2,2,2,,1,2,24,10,,6,1,4,3,1,,1,0,,0,,,1,1,0,,1,2,10,2,126813.52062,,34361.686748
2,0,-8,-8,-8,1,0,0,0,0,0,0,-8,4,1,1,0,2,1,4,5,4,3,1,1,4,6,4,7,2,4,1,2,1,1,0,1,0,5,1,1,1,1,2,-8,0,0,0,1,1,1,1,1,1,1,1,1,1,0,-8,-8,-8,-8,-8,0,0,0,0,1,3,3,3,2,0,1,3,3,3,3,1,2,1,4,4,1,2,0,1,-6,0,1,1,3,0,-8,-8,1,0,0,1,0,-9,-8,-8,-8,-8,-8,-8,-8,-8,-8,-8,1,1,0,0,0,0,0,0,1,1,1,-8,-8,-8,1,1,3,0,0,1,1,1,-8,1,1,1,0,-8,-8,-8,0,1,-8,AUG23,AUG23,103533,3,1,1,2,2,3,3,,1,5,56,15,,8,1,1,2,1,,1,0,1,0,1,1,1,1,0,,1,1,15,1,22245.37163,,6027.6576805
3,0,-8,-8,-8,0,0,1,0,0,0,0,-8,4,1,1,0,3,1,4,1,4,3,-9,6,-9,7,3,2,2,4,2,5,1,0,0,2,0,4,1,0,0,1,1,1,0,1,0,1,1,1,1,0,1,1,1,1,1,1,0,1,0,0,1,0,0,0,0,1,1,1,1,1,0,3,3,3,2,3,0,3,1,2,4,1,1,1,3,1,1,3,0,-8,1,5,2,0,-8,-8,-8,-8,-8,-8,-8,-8,-8,-8,-8,1,1,1,1,1,0,0,0,0,0,0,0,1,0,1,-8,-8,-8,1,1,3,0,0,2,0,0,1,0,1,1,0,-8,-8,-8,0,1,-8,AUG23,AUG23,107060,3,1,1,2,2,2,3,,1,1,70,12,,9,3,1,2,1,,1,0,1,,1,1,1,1,0,,1,1,111,99,62475.605135,,16928.535401
2,0,-8,-8,-8,1,0,0,0,0,0,0,-8,4,1,1,0,3,1,4,2,4,7,1,6,1,1,4,3,1,5,1,4,0,-8,-8,3,1,5,1,0,0,1,3,1,0,1,0,1,1,1,1,1,1,1,1,1,1,1,0,1,1,0,1,0,0,1,1,1,0,0,0,0,0,2,1,1,2,2,2,0,1,3,3,1,2,1,1,4,0,1,1,3,0,-8,-8,0,-8,-8,-8,-8,-8,-8,-8,-8,-8,-8,-8,0,1,0,1,0,0,0,0,0,0,0,0,0,0,3,1,-8,2,2,3,2,0,0,2,0,0,0,1,1,1,0,-8,-8,-8,0,1,-8,AUG23,AUG23,103013,3,1,1,2,2,2,2,,1,1,70,6,,4,2,2,1,1,,1,0,1,0,1,1,1,1,0,,1,1,46,2,51886.786097,,14059.364345
1,1,1,1,1,1,0,0,0,0,-8,0,-8,3,1,1,0,3,1,4,3,4,6,1,1,1,2,4,4,2,7,1,5,1,0,0,2,0,5,1,0,0,1,1,1,0,1,0,1,1,0,1,1,1,1,6,-8,-8,-8,-8,-8,-8,-8,-8,-8,-8,-8,-8,1,1,0,0,0,0,2,0,1,2,1,0,1,1,3,1,1,4,0,1,0,0,-8,0,-8,0,-8,-8,0,-8,-8,-8,-8,-8,-8,-8,-8,-8,-8,-8,1,0,0,0,0,0,0,0,0,0,0,0,0,0,1,-8,-8,-8,1,1,3,1,-8,-8,1,1,-8,0,1,1,0,-8,-8,-8,0,1,-8,AUG23,AUG23,102340,3,1,1,1,1,2,3,,1,2,61,11,,7,1,1,3,1,,1,0,1,0,,,1,1,0,,1,1,3,1,25044.452807,,6786.103232
2,0,-8,-8,-8,0,0,0,0,0,-8,0,-8,4,1,1,0,1,0,-8,-8,-8,-8,-8,-8,-8,-8,-8,-8,-8,-8,-8,-8,1,0,-8,-8,-8,1,3,1,1,2,1,1,0,0,0,1,1,0,0,0,2,2,2,-8,-8,-8,-8,-8,-8,-8,-8,-8,-8,-8,-8,0,-8,-8,-8,-8,-8,2,3,3,3,3,3,3,1,1,2,1,0,0,-8,0,0,-8,0,-8,0,-8,-8,1,1,0,1,0,1,-8,-8,-8,-8,-8,-8,-8,-8,-8,-8,0,0,0,0,0,0,0,0,0,0,1,-8,-8,-8,1,1,3,1,-8,-8,1,1,-8,0,1,1,1,2,1,1,0,1,-8,AUG23,AUG23,106015,3,1,1,1,1,2,2,,4,5,45,9,,3,1,1,4,1,,1,0,1,1,,2,1,1,0,,1,2,13,1,29313.705815,,7942.9099654
4,1,1,1,1,1,0,0,1,0,0,0,-8,4,1,2,1,1,1,4,1,3,7,-9,4,3,3,4,2,3,6,1,5,1,0,0,2,0,1,1,1,0,1,3,1,0,1,1,1,1,1,1,1,1,1,1,1,1,1,1,1,0,0,1,-6,-6,1,1,1,3,3,3,2,0,3,3,2,1,3,2,1,1,2,3,1,4,1,2,2,0,3,0,-8,0,-8,-8,0,-8,-8,-8,-8,-8,-8,-8,-8,-8,-8,-8,-6,-6,-6,1,0,1,0,0,0,0,0,0,1,1,2,0,-8,-8,2,6,4,1,-8,-8,1,1,-8,0,1,1,1,1,1,1,1,1,-8,AUG23,AUG23,100945,3,1,1,2,2,2,3,,4,2,63,9,,5,2,4,3,1,,1,0,1,0,,,1,1,0,,1,1,153,1225,26463.525594,,7170.6184977
1,0,-8,-8,-8,0,0,0,0,0,-8,0,-8,2,1,1,0,2,1,3,5,4,1,3,7,2,2,3,4,2,3,1,6,1,0,0,2,0,5,1,0,0,3,2,-8,0,1,0,1,1,1,1,0,3,4,0,-8,-8,-8,-8,-8,-8,-8,-8,-8,-8,-8,-8,1,0,1,0,0,0,3,3,3,2,2,2,3,1,3,3,2,2,0,1,4,0,3,0,-8,0,-8,-8,0,-8,-8,-8,-8,-8,-8,-8,-8,-8,-8,-8,1,1,1,0,0,0,0,0,0,0,0,0,0,0,3,0,-8,-8,2,5,4,1,-8,-8,1,0,0,0,1,1,0,-8,-8,-8,0,1,-8,AUG23,AUG23,104165,3,1,1,1,1,3,1,,1,2,26,13,,9,1,4,1,2,,1,0,,1,,,1,1,0,,1,2,11,1,60527.126354,,16400.571054
4,1,1,1,1,1,1,1,0,1,-8,1,-8,4,3,3,1,1,1,4,5,4,1,1,2,1,7,4,6,1,4,-9,3,1,1,0,1,1,1,5,1,1,1,1,1,0,1,1,1,1,1,1,1,1,1,-8,-8,-8,-8,-8,-8,-8,-8,-8,-8,-8,-8,-8,1,3,3,3,3,1,3,2,2,3,3,3,3,1,4,4,2,1,1,2,1,1,2,1,3,0,-8,-8,3,1,1,1,1,1,-8,-8,-8,-8,-8,-8,-8,-8,-8,-8,1,0,0,0,1,0,0,0,1,1,2,0,-8,-8,2,6,4,1,-8,-8,1,1,-8,1,1,1,0,-8,-8,-8,1,1,-8,AUG23,AUG23,106380,3,1,1,1,1,1,3,,1,3,48,13,,8,1,1,4,2,,1,0,,0,1,1,1,1,0,,1,1,25,2,26032.453144,,7053.8141032
3,1,1,1,1,0,0,0,0,0,-8,0,-8,4,1,1,0,3,1,1,1,2,4,1,3,4,2,2,6,4,5,1,7,1,0,0,2,1,6,5,0,0,1,3,2,0,1,0,1,1,0,0,0,1,4,4,-8,-8,-8,-8,-8,-8,-8,-8,-8,-8,-8,-8,1,0,0,0,0,0,3,3,3,1,3,2,3,2,4,4,2,0,0,-8,0,0,-8,0,-8,0,-8,-8,0,-8,-8,-8,-8,-8,-8,-8,-8,-8,-8,-8,0,1,0,0,1,1,1,0,0,0,1,0,1,1,1,-8,-8,-8,1,1,3,1,-8,-8,1,0,0,0,1,1,0,-8,-8,-8,0,1,-8,AUG23,AUG23,102988,3,1,1,1,1,2,2,,1,5,61,14,,7,1,1,3,1,,1,0,1,0,1,1,1,1,0,,1,1,50,2,60944.339355,,16513.62006
2,0,-8,-8,-8,1,0,0,0,0,0,0,-8,3,1,1,0,2,1,3,2,-9,6,3,3,-9,7,3,1,-9,4,-9,5,0,-8,-8,3,0,1,5,0,0,1,1,1,0,0,0,1,1,1,0,0,1,2,2,1,3,1,0,1,0,0,1,0,0,0,0,1,3,3,3,0,0,3,4,2,2,2,0,2,1,3,3,1,4,0,1,4,0,1,0,-8,0,-8,-8,0,-8,-8,-8,-8,-8,-8,-8,-8,-8,-8,-8,1,1,0,0,0,0,0,0,0,0,0,1,1,1,2,1,3,-8,2,6,2,1,-8,-8,1,1,-8,0,0,1,0,-8,-8,-8,0,1,-8,AUG23,AUG23,100764,3,1,1,2,2,2,2,,1,3,53,11,,6,1,2,4,1,,1,0,1,0,1,1,1,1,4,,1,2,25,2,21659.514495,,5868.9124675
3,1,1,1,1,0,0,0,0,1,-8,0,-8,4,1,2,0,2,1,4,6,3,7,1,4,2,5,3,2,2,1,1,3,1,0,0,2,1,1,6,0,0,1,1,1,0,0,0,1,1,1,1,1,1,1,1,-8,-8,-8,-8,-8,-8,-8,-8,-8,-8,-8,-8,0,-8,-8,-8,-8,-8,2,1,1,1,1,2,1,2,2,1,2,2,1,1,4,0,1,0,-8,0,-8,-8,3,1,1,0,0,1,-8,-8,-8,-8,-8,-8,-8,-8,-8,-8,0,0,0,0,0,0,0,0,0,0,1,-8,-8,-8,1,1,3,1,-8,-8,1,0,0,0,1,1,0,-8,-8,-8,0,1,-8,AUG23,AUG23,101609,3,1,1,1,1,2,1,,1,4,39,13,,7,1,1,3,1,,1,0,1,0,,1,1,1,4,,1,2,3,2,73389.879982,,19885.89272
4,0,-8,-8,-8,0,0,1,0,0,0,0,-8,2,2,2,1,2,1,3,1,3,7,2,6,2,3,3,2,2,5,1,4,0,-8,-8,3,0,5,6,0,0,4,2,-8,0,0,0,1,1,1,0,0,6,0,0,0,-8,-8,-8,-8,-8,-8,-8,0,0,0,0,1,0,0,0,2,0,3,1,1,3,2,0,1,2,3,3,2,1,0,2,1,0,2,0,-8,0,-8,-8,0,-8,-8,-8,-8,-8,-8,-8,-8,-8,-8,-8,1,1,1,1,0,0,0,0,0,0,0,0,0,0,3,1,-8,3,2,4,1,1,-8,-8,1,0,0,0,0,2,0,-8,-8,-8,0,1,-8,AUG23,AUG23,100629,3,1,1,2,2,,2,,1,2,50,5,,3,1,2,3,1,,1,0,,0,0,1,1,1,0,,1,1,30,1,46236.700154,,12528.403905
1,0,-8,-8,-8,0,0,0,0,0,0,0,-8,2,1,1,0,3,1,4,5,3,6,-9,2,2,3,-9,7,2,4,1,1,1,0,0,2,1,5,1,0,1,1,3,1,0,1,0,1,1,1,1,1,1,1,0,1,1,1,0,1,0,0,1,0,0,0,0,1,3,3,3,2,0,3,3,2,1,3,0,2,3,2,3,2,3,0,3,4,0,1,0,-8,0,-8,-8,0,-8,-8,-8,-8,-8,-8,-8,-8,-8,-8,-8,1,1,0,0,0,0,0,0,0,0,0,0,0,0,1,-8,-8,-8,1,1,3,0,0,2,0,1,-8,0,1,1,0,-8,-8,-8,0,1,-8,AUG23,AUG23,101717,3,1,1,2,2,2,3,,1,1,62,16,,9,1,1,3,1,,1,0,1,,1,,1,1,2,,1,1,108,496,227244.55308,,61574.713091
2,0,-8,-8,-8,0,0,0,0,0,0,0,-8,4,1,1,0,3,0,-8,-8,-8,-8,-8,-8,-8,-8,-8,-8,-8,-8,-8,-8,0,-8,-8,3,-8,5,2,0,0,1,1,1,0,0,0,1,1,1,1,0,1,1,1,1,1,0,-8,-8,-8,-8,-8,0,1,0,0,0,-8,-8,-8,-8,-8,2,0,3,2,2,2,1,1,3,3,2,0,0,-8,0,0,-8,1,1,0,-8,-8,0,-8,-8,-8,-8,-8,-8,-8,-8,-8,-8,-8,1,1,0,0,0,0,0,0,0,0,0,0,0,0,3,0,-8,-8,2,5,4,1,-8,-8,1,0,0,0,1,1,0,-8,-8,-8,1,1,-8,AUG23,AUG23,101383,3,1,1,2,2,2,1,,2,1,53,11,,9,1,4,3,1,,1,0,1,0,,,1,1,4,,1,2,16,1,124191.54741,,33651.230785
3,1,1,1,1,1,1,0,0,0,0,0,0,2,1,1,0,3,0,-8,-8,-8,-8,-8,-8,-8,-8,-8,-8,-8,-8,-8,-8,1,0,-8,-8,-8,6,0,0,0,0,2,-8,0,0,0,1,0,0,0,0,0,0,0,0,-8,-8,-8,-8,-8,-8,-8,1,1,1,-6,0,-8,-8,-8,-8,-8,2,0,0,0,0,0,0,3,3,3,3,4,0,3,4,0,3,0,-8,0,-8,-8,2,0,0,0,0,0,0,0,0,0,0,0,-8,-8,-8,-8,0,0,0,0,0,0,0,0,0,0,1,-8,-8,-8,1,1,3,0,0,0,0,0,0,0,0,2,0,-8,-8,-8,0,0,0,AUG23,AUG23,104436,3,1,1,2,2,2,1,,1,6,30,3,,1,4,1,3,2,,1,0,1,0,1,1,2,0,0,,1,2,21,1,102419.16038,,27751.734111
2,0,-8,-8,-8,0,0,0,0,-6,0,0,-8,2,1,1,0,3,1,3,4,3,1,2,7,3,3,2,5,3,2,3,6,1,0,0,2,0,1,1,0,0,3,3,1,0,1,0,1,1,1,0,1,3,3,3,1,1,1,0,1,0,0,1,0,0,0,0,0,-8,-8,-8,-8,-8,2,3,2,1,1,0,1,1,1,3,1,2,0,3,3,0,3,0,-8,0,-8,-8,0,-8,-8,-8,-8,-8,-8,-8,-8,-8,-8,-8,0,0,0,0,1,0,0,0,0,0,1,0,1,1,1,-8,-8,-8,1,1,3,1,-8,-8,1,0,0,0,0,2,0,-8,-8,-8,1,1,-8,AUG23,AUG23,101709,3,1,1,2,2,2,2,,1,2,56,12,,9,1,1,2,3,,2,0,,0,1,1,4,0,3,,1,1,27,1,28128.003506,,7621.6293076
2,0,-8,-8,-8,1,0,0,0,0,0,0,-8,3,1,1,0,2,1,3,6,3,3,3,1,2,2,3,4,2,7,1,5,0,-8,-8,3,0,1,1,0,0,1,1,1,0,1,0,1,1,1,0,0,1,1,1,1,1,1,0,1,0,0,1,0,1,-6,-6,0,-8,-8,-8,-8,-8,2,2,2,0,2,2,1,3,3,3,2,0,0,-8,0,0,-8,0,-8,0,-8,-8,3,1,0,0,0,1,-8,-8,-8,-8,-8,-8,-8,-8,-8,-8,0,0,0,0,0,0,0,0,0,0,1,-8,-8,-8,1,1,3,0,0,2,0,1,-8,0,1,1,0,-8,-8,-8,1,1,-8,AUG23,AUG23,103096,3,1,1,2,2,2,2,,1,2,70,12,,9,3,1,3,1,,1,0,1,0,1,1,1,1,4,,1,1,111,1547,24765.521504,,6710.523357
4,1,1,1,1,1,0,0,0,0,-8,0,-8,3,1,1,1,3,0,-8,-8,-8,-8,-8,-8,-8,-8,-8,-8,-8,-8,-8,-8,0,-8,-8,3,-8,1,4,1,1,1,1,1,1,1,0,1,1,1,1,1,1,1,1,-8,-8,-8,-8,-8,-8,-8,-8,-8,-8,-8,-8,0,-8,-8,-8,-8,-8,2,0,0,0,0,0,0,3,3,3,3,3,0,3,3,0,3,1,1,0,-8,-8,0,-8,-8,-8,-8,-8,-8,-8,-8,-8,-8,-8,1,1,1,1,1,1,0,1,0,0,0,0,1,1,3,0,-8,-8,2,5,4,0,0,3,0,0,0,0,0,2,0,-8,-8,-8,0,1,-8,AUG23,AUG23,101309,3,1,1,1,1,2,1,,1,2,49,1,,1,2,4,1,2,,1,0,1,0,1,1,1,1,0,,1,2,1,2,40060.250206,,10854.81865
3,0,-8,-8,-8,0,0,0,0,0,0,0,0,4,1,1,0,3,1,3,7,3,6,1,1,1,3,1,4,1,2,1,5,0,-8,-8,3,0,5,1,0,0,6,1,2,0,1,0,1,1,1,0,0,6,6,6,1,4,0,-8,-8,-8,-8,-8,0,0,0,0,0,-8,-8,-8,-8,-8,2,2,3,2,1,2,2,1,3,2,2,3,0,1,0,0,-8,1,3,0,-8,-8,0,-8,-8,-8,-8,-8,-8,-8,-8,-8,-8,-8,1,1,0,0,0,0,0,0,0,0,0,0,0,0,1,-8,-8,-8,1,1,3,1,-8,-8,1,0,0,0,0,2,0,-8,-8,-8,0,1,-8,AUG23,AUG23,104340,3,1,1,2,2,2,3,,1,4,49,15,,9,1,1,3,1,,1,0,1,0,1,1,1,1,0,,1,2,51,1,201487.9897,,54595.654722
3,1,1,1,1,0,0,0,1,0,0,0,-8,2,1,1,0,3,1,3,7,4,3,-9,5,-9,6,4,2,-9,1,-9,4,1,0,0,2,0,1,1,0,0,1,1,1,0,1,0,1,1,1,1,1,1,1,1,1,1,0,-8,-8,-8,-8,-8,0,0,0,0,0,-8,-8,-8,-8,-8,2,0,0,0,0,0,0,1,3,1,2,4,0,3,4,0,1,1,3,0,-8,-8,0,-8,-8,-8,-8,-8,-8,-8,-8,-8,-8,-8,1,1,0,0,0,0,0,0,0,0,0,0,0,0,1,-8,-8,-8,1,1,3,0,0,2,0,0,0,0,1,1,0,-8,-8,-8,1,1,-8,AUG23,AUG23,103632,3,1,1,2,2,2,2,,1,2,70,9,,5,3,1,2,1,,1,0,,0,1,1,1,1,3,,1,1,31,2,101295.13357,,27447.16519
3,0,-8,-8,-8,0,0,0,0,0,1,0,0,4,1,2,1,1,0,-8,-8,-8,-8,-8,-8,-8,-8,-8,-8,-8,-8,-8,-8,1,0,-8,-8,-8,1,2,1,1,1,1,1,0,0,1,1,1,1,1,1,1,-6,1,1,1,1,0,1,0,0,1,1,0,0,0,0,-8,-8,-8,-8,-8,3,1,1,0,0,0,0,3,3,3,3,1,0,1,1,0,1,1,3,0,-8,-8,0,-8,-8,-8,-8,-8,-8,-8,-8,-8,-8,-8,0,1,0,1,0,0,0,1,0,0,1,1,1,1,1,-8,-8,-8,1,1,3,1,-8,-8,1,0,1,1,1,1,0,-8,-8,-8,0,1,-8,AUG23,AUG23,104139,3,1,1,2,2,2,2,,2,5,41,5,,2,1,1,2,1,,1,0,,0,,,1,1,0,,1,2,28,1,130508.76791,,35362.959556
2,1,0,-8,1,1,0,0,1,1,-8,0,-8,2,1,1,0,3,1,4,2,3,1,2,4,1,3,4,6,4,5,-9,7,1,0,0,2,0,5,1,0,0,1,3,4,0,0,1,1,1,0,0,0,1,1,1,-8,-8,-8,-8,-8,-8,-8,-8,-8,-8,-8,-8,1,3,3,3,0,0,-9,0,0,-9,-9,3,-9,1,1,1,3,0,0,-8,0,0,-8,1,3,0,-8,-8,3,1,0,1,0,1,-8,-8,-8,-8,-8,-8,-8,-8,-8,-8,0,0,0,0,0,0,0,0,0,0,1,-8,-8,-8,1,1,3,0,0,2,0,1,-8,0,1,1,0,-8,-8,-8,1,1,-8,AUG23,AUG23,102978,3,1,1,1,1,2,1,,2,2,70,13,,9,3,1,2,1,,1,0,,1,1,1,1,1,0,1,2,5,5,2,65573.339404,,17767.904689
4,0,-8,-8,-8,0,0,1,0,0,0,0,0,4,3,3,0,3,1,3,1,2,7,3,6,3,2,4,4,1,3,3,5,1,1,0,1,0,6,-6,0,0,1,1,1,0,-6,1,1,1,1,1,1,1,1,1,0,-8,-8,-8,-8,-8,-8,-8,0,0,0,0,1,0,0,0,0,1,3,0,0,3,3,2,3,3,3,4,4,0,0,-8,3,0,2,0,-8,0,-8,-8,3,1,1,1,1,1,-8,-8,-8,-8,-8,-8,-8,-8,-8,-8,1,1,1,1,1,1,1,0,1,1,3,1,-8,2,2,3,2,0,0,3,0,0,0,0,0,2,0,-8,-8,-8,1,1,-8,AUG23,AUG23,100907,3,1,1,2,2,4,2,,3,1,42,2,,2,2,2,2,2,,2,0,,0,1,1,1,1,0,,1,2,3,1,34307.143196,,9295.9433818
3,1,1,1,1,0,0,0,0,1,0,0,0,4,1,3,0,1,1,4,5,4,6,1,7,2,1,3,3,1,4,1,2,1,1,1,1,1,5,1,0,0,1,1,1,1,1,0,1,1,1,1,1,1,2,1,0,-8,-8,-8,-8,-8,-8,-8,0,0,0,0,0,-8,-8,-8,-8,-8,2,2,2,3,2,1,2,1,3,1,1,2,1,2,3,1,2,1,3,1,1,3,0,-8,-8,-8,-8,-8,-8,-8,-8,-8,-8,-8,0,1,1,1,0,0,0,0,0,0,0,0,0,0,1,-8,-8,-8,1,1,3,1,-8,-8,1,1,-8,0,1,1,0,-8,-8,-8,0,1,-8,AUG23,AUG23,105066,3,1,1,2,2,2,3,,1,4,36,12,,6,1,1,2,1,,2,0,1,0,1,1,1,1,0,,1,2,81,20,34395.278338,,9319.8246851
1,0,-8,-8,-8,1,0,0,0,0,0,0,-8,2,1,2,0,3,0,-8,-8,-8,-8,-8,-8,-8,-8,-8,-8,-8,-8,-8,-8,0,-8,-8,3,-8,5,1,0,0,1,1,1,0,1,1,1,1,1,1,1,1,2,2,1,1,1,1,0,1,0,1,0,0,0,0,0,-8,-8,-8,-8,-8,2,2,2,3,0,3,3,1,3,1,2,1,0,3,0,0,-8,0,-8,0,-8,-8,1,1,0,0,0,-9,-8,-8,-8,-8,-8,-8,-8,-8,-8,-8,0,0,0,0,0,0,0,0,0,0,3,1,-8,2,2,3,2,1,-8,-8,1,1,-8,0,1,1,0,-8,-8,-8,0,1,-8,AUG23,AUG23,103894,3,1,1,2,2,2,2,,1,3,56,13,,8,1,2,2,1,,1,0,1,0,1,1,5,0,0,,1,1,107,878,15407.466603,,4174.843017
2,1,0,-8,0,1,0,0,0,0,0,0,0,2,1,1,0,3,1,3,7,4,1,2,6,4,3,4,2,-9,5,4,4,1,0,0,2,0,5,1,0,0,1,3,1,0,1,0,1,1,1,1,1,1,1,1,-8,-8,-8,-8,-8,-8,-8,-8,0,0,0,0,1,3,3,3,3,0,3,4,4,3,0,0,1,1,3,1,2,0,0,-8,0,0,-8,0,-8,0,-8,-8,3,1,1,1,1,-9,-8,-8,-8,-8,-8,-8,-8,-8,-8,-8,0,0,0,0,0,0,0,0,0,0,3,0,-8,-8,2,5,4,1,-8,-8,1,1,-8,0,0,1,1,1,-6,1,0,1,-8,AUG23,AUG23,102378,3,1,1,2,2,2,2,,3,3,24,10,,5,1,4,4,1,,1,0,1,0,1,1,1,1,0,,1,2,54,2,85211.26466,,23089.042631
2,0,-8,-8,-8,1,0,1,0,0,0,0,-8,2,1,1,0,3,1,4,4,4,3,1,2,1,1,4,6,3,7,1,5,0,-8,-8,3,1,5,1,0,0,1,1,1,0,1,0,1,1,1,1,1,1,1,1,1,1,1,0,1,1,0,1,0,1,0,0,1,2,0,0,0,0,2,4,4,3,2,0,3,1,3,3,1,4,0,3,0,0,-8,1,3,0,-8,-8,0,-8,-8,-8,-8,-8,-8,-8,-8,-8,-8,-8,1,1,1,-6,0,0,0,0,0,0,0,0,0,0,1,-8,-8,-8,1,1,3,0,0,2,0,1,-8,1,1,1,0,-8,-8,-8,1,1,-8,AUG23,AUG23,104705,3,1,1,2,,,3,,1,2,70,10,,6,3,1,1,1,,1,0,,0,,,2,0,3,,1,1,1,1,25113.91382,,6804.9245498
4,0,-8,-8,-8,1,0,0,0,-6,-8,0,-8,3,1,2,1,3,1,4,7,4,5,1,2,1,1,3,3,1,4,1,6,1,0,0,2,0,5,1,0,0,2,3,1,0,0,0,1,1,1,1,1,1,2,2,-8,-8,-8,-8,-8,-8,-8,-8,-8,-8,-8,-8,0,-8,-8,-8,-8,-8,3,0,0,2,2,0,1,1,3,3,3,4,0,1,0,0,-8,0,-8,0,-8,-8,0,-8,-8,-8,-8,-8,-8,-8,-8,-8,-8,-8,0,0,0,1,0,0,0,0,0,0,0,0,0,0,3,0,-8,-8,2,5,4,1,-8,-8,1,0,0,0,0,2,0,-8,-8,-8,0,1,-8,AUG23,AUG23,103616,3,1,1,1,1,2,3,,2,1,31,15,,9,1,4,4,1,,1,0,,0,,,1,1,0,,1,2,157,3470,15580.97304,,4221.856725
2,1,1,1,1,1,1,1,1,1,1,0,0,4,1,1,0,2,0,-8,-8,-8,-8,-8,-8,-8,-8,-8,-8,-8,-8,-8,-8,1,0,-8,-8,-8,1,1,0,0,1,1,1,0,1,0,1,1,1,0,0,1,1,1,-8,-8,-8,-8,-8,-8,-8,-8,0,0,1,0,1,0,0,0,0,0,2,2,2,3,0,2,0,1,3,1,2,1,0,1,4,0,1,0,-8,0,-8,-8,0,-8,-8,-8,-8,-8,-8,-8,-8,-8,-8,-8,0,0,0,1,0,0,0,0,0,0,0,0,0,0,1,-8,-8,-8,1,1,3,0,0,4,0,0,0,0,0,2,0,-8,-8,-8,0,1,-8,AUG23,AUG23,106000,3,1,1,2,2,2,2,,1,5,27,11,,4,4,1,3,1,,1,0,,0,1,1,1,1,0,,1,2,2,2,37819.99936,,10247.795065
2,0,-8,-8,-8,0,0,0,0,0,-8,0,-8,2,1,1,0,3,0,-8,-8,-8,-8,-8,-8,-8,-8,-8,-8,-8,-8,-8,-8,1,0,-8,-8,-8,3,1,0,0,1,2,-8,0,1,0,1,1,1,1,0,1,3,3,-8,-8,-8,-8,-8,-8,-8,-8,-8,-8,-8,-8,0,-8,-8,-8,-8,-8,3,1,1,1,1,2,3,3,3,2,1,2,0,3,4,0,2,0,-8,0,-8,-8,0,-8,-8,-8,-8,-8,-8,-8,-8,-8,-8,-8,1,0,0,0,0,0,0,0,0,0,0,0,0,0,3,0,-8,-8,2,5,4,1,-8,-8,1,1,-8,0,1,1,1,1,1,1,1,1,-8,AUG23,AUG23,104746,3,1,1,1,1,2,2,,3,4,22,15,,9,1,4,4,1,,1,0,,0,,,1,1,0,,1,1,26,2,24158.940689,,6546.1628072
3,1,1,1,1,1,0,0,0,1,1,0,-8,4,2,1,1,3,0,-8,-8,-8,-8,-8,-8,-8,-8,-8,-8,-8,-8,-8,-8,1,0,-8,-8,-8,5,2,0,0,1,1,1,0,1,1,1,1,0,1,1,1,1,1,1,1,1,0,0,1,0,1,0,1,1,1,1,0,0,0,0,0,2,0,0,0,0,0,0,1,3,3,1,0,0,-8,4,0,1,1,3,0,-8,-8,0,-8,-8,-8,-8,-8,-8,-8,-8,-8,-8,-8,0,1,1,0,0,0,0,0,0,0,0,0,0,0,1,-8,-8,-8,1,1,3,0,0,2,0,0,0,0,1,1,0,-8,-8,-8,1,1,-8,AUG23,AUG23,101062,3,1,1,2,2,2,1,,1,2,68,10,,6,3,1,1,1,,1,0,1,1,1,1,1,1,0,,1,1,44,2,132838.31514,,35994.179097
3,1,1,0,0,0,0,0,0,0,0,0,0,3,1,1,0,2,1,4,1,-9,3,2,5,2,7,4,6,1,2,2,4,1,0,0,2,0,1,2,0,0,1,3,1,0,1,0,1,1,1,1,1,1,1,1,0,-8,-8,-8,-8,-8,-8,-8,0,0,0,-6,1,1,1,1,0,0,3,3,3,1,1,1,1,2,2,3,2,1,1,3,4,0,1,0,-8,0,-8,-8,0,-8,-8,-8,-8,-8,-8,-8,-8,-8,-8,-8,0,0,0,0,0,0,0,0,0,0,0,0,0,0,3,0,-8,-8,2,5,4,1,-8,-8,1,0,0,0,0,2,0,-8,-8,-8,-6,-6,-8,AUG23,AUG23,106965,3,1,1,2,2,3,3,,1,5,35,14,,7,1,4,3,1,,1,0,,0,1,1,1,1,3,,1,2,22,2,75825.020295,,20545.724008
3,0,-8,-8,-8,0,0,0,0,0,1,0,0,4,1,1,0,2,1,3,6,3,7,-9,5,2,1,3,3,-9,4,2,2,1,0,0,2,0,5,3,1,1,1,1,1,0,1,0,1,1,1,1,1,1,-6,3,-8,-8,-8,-8,-8,-8,-8,-8,0,0,0,0,0,-8,-8,-8,-8,-8,3,2,2,2,3,2,2,1,2,4,2,3,1,2,0,0,-8,0,-8,0,-8,-8,0,-8,-8,-8,-8,-8,-8,-8,-8,-8,-8,-8,0,0,0,0,0,0,0,0,0,0,0,0,0,0,2,0,-8,-8,2,6,4,0,0,7,0,0,0,0,0,2,0,-8,-8,-8,0,1,-8,AUG23,AUG23,105213,3,1,1,2,2,2,3,,4,3,26,10,,5,4,4,3,1,,1,0,,0,,,2,0,0,,1,2,6,2,125836.58279,,34096.973401
3,1,1,1,1,1,0,1,0,1,1,1,-8,4,1,1,0,2,1,4,1,4,6,1,3,1,5,3,4,2,7,1,2,1,0,0,2,0,3,1,0,0,1,1,1,1,1,0,1,1,1,1,1,1,1,-8,1,1,0,-8,-8,-8,-8,-8,1,0,0,0,1,1,0,1,0,0,2,4,1,2,2,1,1,1,2,3,1,0,0,-8,4,1,2,0,-8,0,-8,-8,0,-8,-8,-8,-8,-8,-8,-8,-8,-8,-8,-8,0,1,1,-6,1,1,1,0,1,1,0,0,1,1,2,1,3,-8,2,6,2,1,-8,-8,1,1,-8,0,1,1,0,-8,-8,-8,0,1,-8,AUG23,AUG23,102665,3,1,1,2,2,2,2,,1,2,69,5,,3,3,2,4,2,,1,0,1,0,1,1,1,1,0,,1,2,109,1410,19480.424884,,5278.4612739
3,0,-8,-8,-8,0,0,1,0,0,0,0,0,4,1,1,0,3,1,4,5,4,6,3,4,1,2,4,1,1,3,1,7,1,1,0,1,0,1,1,0,0,1,1,1,0,1,1,1,1,1,1,1,1,1,1,-8,-8,-8,-8,-8,-8,-8,-8,0,0,0,0,1,1,1,0,0,1,3,2,2,2,2,2,0,3,3,3,2,2,0,3,1,1,1,0,-8,0,-8,-8,3,1,0,1,0,1,-8,-8,-8,-8,-8,-8,-8,-8,-8,-8,1,1,1,1,1,0,0,0,1,1,3,0,-8,-8,2,5,4,1,-8,-8,1,1,-8,0,1,1,0,-8,-8,-8,0,1,-8,AUG23,AUG23,103758,3,1,1,2,2,2,3,,1,3,28,10,,5,1,4,2,1,,2,0,1,0,1,1,1,1,0,,1,2,47,1,70223.9709,,19028.050625
4,1,1,1,1,1,0,0,0,0,-8,0,-8,2,1,1,0,3,0,-8,-8,-8,-8,-8,-8,-8,-8,-8,-8,-8,-8,-8,-8,0,-8,-8,3,-8,1,6,0,0,1,3,1,0,1,0,1,1,0,0,1,1,1,1,-8,-8,-8,-8,-8,-8,-8,-8,-8,-8,-8,-8,1,0,0,0,0,0,2,1,1,2,3,3,2,2,3,2,1,0,0,-8,0,0,-8,1,3,0,-8,-8,3,1,1,1,0,1,-8,-8,-8,-8,-8,-8,-8,-8,-8,-8,0,0,0,0,0,0,0,0,0,0,1,-8,-8,-8,1,1,3,0,0,2,0,0,0,0,1,1,0,-8,-8,-8,0,1,-8,AUG23,AUG23,104118,3,1,1,1,1,2,2,,1,2,70,8,,4,3,1,3,1,,1,0,1,0,1,1,1,1,0,,1,1,111,625,30883.436872,,8368.2479465
3,0,-8,-8,-8,0,0,0,0,1,1,0,-8,3,1,1,0,3,1,4,3,4,6,1,2,2,4,4,7,2,1,2,5,1,1,0,1,1,1,1,0,0,1,1,1,0,1,0,1,1,0,1,1,1,1,1,1,2,0,-8,-8,-8,-8,-8,1,0,0,0,0,-8,-8,-8,-8,-8,2,3,3,0,1,1,3,4,3,2,2,4,0,1,0,0,-8,0,-8,0,-8,-8,0,-8,-8,-8,-8,-8,-8,-8,-8,-8,-8,-8,1,0,0,0,0,0,0,0,0,0,0,0,0,0,1,-8,-8,-8,1,1,3,1,-8,-8,1,0,0,0,0,2,0,-8,-8,-8,0,1,-8,AUG23,AUG23,107011,3,1,1,2,2,2,3,,4,6,53,14,,6,1,1,3,1,,1,0,1,0,,,1,1,0,,1,2,153,1337,123869.78603,,33564.045572
3,0,-8,-8,-8,0,0,0,0,0,1,0,0,4,1,1,0,3,1,3,6,3,4,-9,1,3,7,3,5,3,2,3,3,1,0,0,2,0,1,1,1,0,1,3,1,0,1,0,1,1,1,0,1,1,5,2,1,3,0,-8,-8,-8,-8,-8,0,0,1,0,0,-8,-8,-8,-8,-8,2,1,1,2,1,1,2,2,3,3,2,0,0,-8,0,0,-8,0,-8,0,-8,-8,1,1,1,1,0,1,-8,-8,-8,-8,-8,-8,-8,-8,-8,-8,0,0,0,0,0,0,0,0,0,0,1,-8,-8,-8,1,1,3,1,-8,-8,1,1,-8,0,1,1,0,-8,-8,-8,0,1,-8,AUG23,AUG23,105730,3,1,1,2,2,2,3,,1,4,37,11,,5,1,1,3,1,,2,0,1,0,1,1,1,1,0,,1,2,50,2,56613.212203,,15340.047765
2,0,-8,-8,-8,0,0,0,0,0,-8,0,-8,3,1,1,0,3,1,1,1,3,6,2,5,2,4,2,3,2,7,-9,2,0,-8,-8,3,0,5,3,-6,0,2,2,-8,0,0,0,1,1,1,0,0,1,1,1,-8,-8,-8,-8,-8,-8,-8,-8,-8,-8,-8,-8,1,1,2,2,0,1,2,2,2,0,2,1,1,3,3,3,2,4,0,3,0,0,-8,0,-8,0,-8,-8,2,1,0,0,1,1,-8,-8,-8,-8,-8,-8,-8,-8,-8,-8,0,0,0,0,0,0,0,0,0,0,1,-8,-8,-8,1,1,3,1,-8,-8,1,1,-8,0,0,1,0,-8,-8,-8,0,1,-8,AUG23,AUG23,102951,3,1,1,1,1,2,2,,1,2,38,13,,9,1,1,2,1,,1,0,,0,,,1,1,0,,1,2,124,282,53199.33476,,14415.015586